{"text_format":"1","workbook":"xlsx","n_sheets":7,"sheets":["総合振込（全銀形式）レコードフォーマット","支店コード ","社員データ","部門コード","支払データ","全銀形式（データ)","全銀形式（ソート)"],"not_rendered":{"charts":0,"images":0,"macros":1,"external_links":0,"defined_names":2,"comments":0,"pivot_tables":0},"unopened":[],"bounds":{"document_bytes":16777216,"sheet_cells":100000,"rows_first":2000,"rows_last":500,"rows_between":2000,"halvings":0,"cell_chars":16384,"cell_head_chars":4096},"cells_cut":0,"cells_raw":0,"read":"whole","date_system":"1904"}

{"sheet":"総合振込（全銀形式）レコードフォーマット","index":0,"n_rows":54,"n_cols":4,"rows_kept":54,"cut":false,"hidden":false,"merged":[]}
["①ヘッダレコード"]
["項番","項目名","属性","項目内容"]
[1,"データ区分","N(1)","「1」ヘッダレコードをセット"]
["2","種別コード","N(2)","「21」総合振込"]
["3","コード区分","N(1)","使用文字コードの区分（0：JIS　1：EBCDIC）\n・BizSTATIONでは取り込みません（スペースで可）"]
["4","振込依頼人コード","N(10)","お客さまの契約者番号（スペースで可）\n企業コードをご利用の場合は、企業コードをセット"]
["5","振込依頼人名","C(40)","振込依頼人名を左詰めでセット（残りはスペース）＊１"]
["6","取組日","N(4)","振込指定日（MMDD）をセット　（例）0903"]
["7","仕向銀行番号","N(4)","「0005」をセット"]
["8","仕向銀行名","C(15)","「ﾐﾂﾋﾞｼﾄｳｷﾖｳUFJ」を左詰めでセット（残りはスペース）＊１"]
["9","仕向支店番号","N(3)","統一店番号を右詰めでセット（前は\"0\"で埋めます）"]
["10","仕向支店名","C(15)","仕向支店名を左詰めでセット（残りはスペース）＊１"]
["11","預金種目（依頼人）","N(1)","預金種目\n1：普通預金　2：当座預金"]
["12","口座番号（依頼人）","N(7)","口座番号を右詰めでセット（前は\"0\"で埋めます）"]
["13","ダミー","C(17)","スペースをセット"]
[]
["②データレコード"]
["項番","項目名","属性","項目内容"]
["1","データ区分","N(1)","「2」データレコードをセット"]
["2","被仕向銀行番号","N(4)","統一金融機関番号を右詰めでセット（前は\"0\"で埋めます）"]
["3","被仕向銀行名","C(15)","被仕向銀行名を左詰めでセット（残りはスペース）＊１"]
["4","被仕向支店番号","N(3)","統一店番号を右詰めでセット（前は\"0\"で埋めます）"]
["5","被仕向支店名","C(15)","被仕向支店名を左詰めでセット（残りはスペース）＊１"]
["6","手形交換所番号","N(4)","スペースをセット"]
["7","預金種目","N(1)","科目\n1：普通預金　2：当座預金　4：貯蓄預金　9：その他"]
["8","口座番号","N(7)","口座番号を右詰めでセット（前は\"0\"で埋めます）\n＜出力ファイルの場合＞\n弊行：数字のみ（預金種目\"その他\"の場合、ブランクあり）\n他行：数字記号（ハイフン、ブランク）"]
["9","受取人名","C(30)","受取人名を左詰めでセット（残りはスペース）＊１\n＜入力ファイルの場合＞\n受取人名の許容記号：「・」（中黒）は「．」（ピリオド）に\n変換して取り込みを行います。"]
["10","振込金額","N(10)","振込金額を右詰めでセット（前は\"0\"で埋めます)"]
["11","新規コード","N(1)","「0」固定"]
["12","顧客コード1","C(10)","依頼人が定めた受取人識別のための顧客コード＊２"]
["13","顧客コード2（振込依頼人番号）【顧客コード2】","C(10)","依頼人が定めた受取人識別のための顧客コード＊２\n・振込依頼人番号を設定する場合は「数字のみ」\n・振込依頼人番号を設定する場合、項番15の識別表示は「X」"]
["12\n及び\n13","EDI情報","C(20)","項番15の識別表示が「Y」の場合、\n「依頼人から受取人に対して通知するEDI情報」になります"]
["14","振込指定区分","N(1)","テレ振込「7」をセット"]
["15","識別表示","C(1)","「X」・「Y」・「スペース」"]
["16","ダミー","C(7)","スペースをセット"]
["③トレーラーレコード"]
["項番","項目名","属性","項目内容"]
["1","データ区分","N(1)","「8」トレーラーレコードをセット"]
["2","合計件数","N(6)","合計件数をセット\n（6桁以内の場合は右詰め。前は\"0\"で埋めます）＊２"]
["3","合計金額","N(12)","合計金額をセット\n（12桁以内の場合は右詰め。前は\"0\"で埋めます）＊２"]
["4","ダミー","C(101)","スペースをセット"]
[]
["④エンドレコード"]
["項番","項目名","属性","項目内容"]
["1","データ区分","N(1)","「9」エンドレコードをセット"]
["2","ダミー","C(119)","スペースをセット"]
["◯文字コードは「シフトＪＩＳコード」（半角文字のみ、全角文字は使用不可）です"]
["◯属性　Ｎ：数字　Ｃ:文字　カッコ内はバイト数"]
["　半角文字は１文字あたり１バイトになります"]
["◯項目名の【】は、全銀フォーマットでの項目名になります"]
["※１　許容記号：￥「」（）ー／＊＆＄，．＠＝％＋；スペース（１８文字）"]
["※２　許容記号：￥「」（）ー／．スペース（９文字）"]
["☆このレコードフォーマットは、三菱東京ＵＦＪ銀行のBizStationのヘルプに基づいて作成しました。"]
["https://bizstation.bk.mufg.jp/biz/help/"]

{"sheet":"支店コード ","index":1,"n_rows":723,"n_cols":4,"rows_kept":723,"cut":false,"hidden":false,"merged":[]}
["店番","支店名","支店名（ｶﾅ）","支店名（ｶﾅ）\n文字数"]
["001","本店","ﾎﾝﾃﾝ           ",{"$f":"LEN(C2)","v":15}]
["002","丸の内","ﾏﾙﾉｳﾁ          ",{"$f":"LEN(C3)","v":15}]
["003","瓦町","ｶﾜﾗﾏﾁ          ",15]
["004","船場","ｾﾝﾊﾞ           ",15]
["005","大阪営業部","ｵｵｻｶ           ",15]
["006","歌島橋","ｳﾀｼﾞﾏﾊﾞｼ       ",15]
["007","玉造","ﾀﾏﾂｸﾘ          ",15]
["010","神田駅前","ｶﾝﾀﾞｴｷﾏｴ       ",15]
["011","大東","ﾀﾞｲﾄｳ          ",15]
["012","伊勢","ｲｾ             ",15]
["013","神保町","ｼﾞﾝﾎﾞｳﾁﾖｳ      ",15]
["014","市ヶ谷","ｲﾁｶﾞﾔ          ",15]
["015","麹町中央","ｺｳｼﾞﾏﾁﾁﾕｳｵｳ    ",15]
["016","鶴橋","ﾂﾙﾊｼ           ",15]
["017","生野","ｲｸﾉ            ",15]
["018","鴻池新田","ｺｳﾉｲｹｼﾝﾃﾞﾝ     ",15]
["019","谷町","ﾀﾆﾏﾁ           ",15]
["020","日本橋","ﾆﾎﾝﾊﾞｼ         ",15]
["021","寺田町","ﾃﾗﾀﾞﾁﾖｳ        ",15]
["022","八重洲通","ﾔｴｽﾄﾞｵﾘ        ",15]
["023","京橋","ｷﾖｳﾊﾞｼ         ",15]
["024","銀座通","ｷﾞﾝｻﾞﾄﾞｵﾘ      ",15]
["025","築地","ﾂｷﾁﾞ           ",15]
["026","枚岡","ﾋﾗｵｶ           ",15]
["027","大伝馬町","ｵｵﾃﾞﾝﾏﾁﾖｳ      ",15]
["028","淡路","ｱﾜｼﾞ           ",15]
["029","森小路","ﾓﾘｼﾖｳｼﾞ        ",15]
["030","都島","ﾐﾔｺｼﾞﾏ         ",15]
["031","心斎橋","ｼﾝｻｲﾊﾞｼ        ",15]
["032","上町","ｳｴﾏﾁ           ",15]
["033","大阪恵美須","ｵｵｻｶｴﾋﾞｽ       ",15]
["034","日本一","ﾆﾂﾎﾟﾝｲﾁ        ",15]
["035","難波","ﾅﾝﾊﾞ           ",15]
["036","信濃橋","ｼﾅﾉﾊﾞｼ         ",15]
["037","天神橋","ﾃﾝｼﾞﾝﾊﾞｼ       ",15]
["038","瑞江","ﾐｽﾞｴ           ",15]
["039","天六","ﾃﾝﾛｸ           ",15]
["040","梅田新道","ｳﾒﾀﾞｼﾝﾐﾁ       ",15]
["041","虎ノ門","ﾄﾗﾉﾓﾝ          ",15]
["042","清水","ｼﾐｽﾞ           ",15]
["043","田町","ﾀﾏﾁ            ",15]
["044","梅田","ｳﾒﾀﾞ           ",15]
["045","六本木","ﾛﾂﾎﾟﾝｷﾞ        ",15]
["046","上本町","ｳｴﾎﾝﾏﾁ         ",15]
["047","広尾","ﾋﾛｵ            ",15]
["048","針中野","ﾊﾘﾅｶﾉ          ",15]
["049","萩ノ茶屋","ﾊｷﾞﾉﾁﾔﾔ        ",15]
["050","新宿通","ｼﾝｼﾞﾕｸﾄﾞｵﾘ     ",15]
["051","四谷","ﾖﾂﾔ            ",15]
["052","神楽坂","ｶｸﾞﾗｻﾞｶ        ",15]
["053","高田馬場","ﾀｶﾀﾉﾊﾞﾊﾞ       ",15]
["054","九条","ｸｼﾞﾖｳ          ",15]
["055","新宿西","ｼﾝｼﾞﾕｸﾆｼ       ",15]
["056","あびこ","ｱﾋﾞｺ           ",15]
["057","築港","ﾁﾂｺｳ           ",15]
["058","堂島","ﾄﾞｳｼﾞﾏ         ",15]
["059","野田","ﾉﾀﾞ            ",15]
["060","江戸川橋","ｴﾄﾞｶﾞﾜﾊﾞｼ      ",15]
["061","駒込","ｺﾏｺﾞﾒ          ",15]
["062","春日町","ｶｽｶﾞﾁﾖｳ        ",15]
["063","千駄木","ｾﾝﾀﾞｷﾞ         ",15]
["064","赤坂見附","ｱｶｻｶﾐﾂｹ        ",15]
["065","上野中央","ｳｴﾉﾁﾕｳｵｳ       ",15]
["066","城東","ｼﾞﾖｳﾄｳ         ",15]
["067","大阪駅前","ｵｵｻｶｴｷﾏｴ       ",15]
["068","十三","ｼﾞﾕｳｿｳ         ",{"$f":"LEN(C67)","v":15}]
["069","浅草橋","ｱｻｸｻﾊﾞｼ        ",15]
["070","今里","ｲﾏｻﾞﾄ          ",15]
["071","玉出","ﾀﾏﾃﾞ           ",15]
["072","阿倍野橋","ｱﾍﾞﾉﾊﾞｼ        ",15]
["073","放出","ﾊﾅﾃﾝ           ",15]
["074","江坂","ｴｻｶ            ",15]
["075","新百合ヶ丘","ｼﾝﾕﾘｶﾞｵｶ       ",15]
["076","平野南口","ﾋﾗﾉﾐﾅﾐｸﾞﾁ      ",15]
["077","大阪ポートタウン","ｵｵｻｶﾎﾟ-ﾄﾀｳﾝ    ",15]
["078","上新庄","ｶﾐｼﾝｼﾞﾖｳ       ",15]
["079","武蔵小杉駅前","ﾑｻｼｺｽｷﾞｴｷﾏｴ    ",15]
["080","本所中央","ﾎﾝｼﾞﾖﾁﾕｳｵｳ     ",15]
["081","押上","ｵｼｱｹﾞ          ",15]
["082","錦糸町","ｷﾝｼﾁﾖｳ         ",15]
["083","新大阪駅前","ｼﾝｵｵｻｶｴｷﾏｴ     ",15]
["084","青山通","ｱｵﾔﾏﾄﾞｵﾘ       ",15]
["085","亀戸北口","ｶﾒｲﾄﾞｷﾀｸﾞﾁ     ",15]
["086","深川","ﾌｶｶﾞﾜ          ",15]
["087","茨木西","ｲﾊﾞﾗｷﾆｼ        ",15]
["088","寝屋川","ﾈﾔｶﾞﾜ          ",15]
["089","青葉台駅前","ｱｵﾊﾞﾀﾞｲｴｷﾏｴ    ",15]
["091","経堂","ｷﾖｳﾄﾞｳ         ",15]
["092","中之島","ﾅｶﾉｼﾏ          ",15]
["095","平針","ﾋﾗﾊﾞﾘ          ",15]
["097","土古","ﾄﾞﾝｺ           ",15]
["098","汁谷出張所","ｼﾙﾀﾆ           ",15]
["099","東京都庁第二本庁舎出張所","ﾄｳｷﾖｳﾄﾁﾖｳ      ",15]
["100","大阪公務部","ｵｵｻｶｺｳﾑﾌﾞ      ",15]
["102","東京為替集中","ﾄｳｷﾖｳｶﾜｾｼﾕｳﾁﾕｳ ",15]
["103","千代田","ﾁﾖﾀﾞ           ",15]
["104","目黒駅前","ﾒｸﾞﾛｴｷﾏｴ       ",15]
["105","小山","ｺﾔﾏ            ",15]
["108","大阪為替集中","ｵｵｻｶｶﾜｾｼﾕｳﾁﾕｳ  ",15]
["109","御堂筋","ﾐﾄﾞｳｽｼﾞ        ",15]
["110","自由が丘駅前","ｼﾞﾕｳｶﾞｵｶｴｷﾏｴ   ",15]
["111","都立大学駅前","ﾄﾘﾂﾀﾞｲｶﾞｸｴｷﾏｴ  ",15]
["112","宇治大久保","ｳｼﾞｵｵｸﾎﾞ       ",15]
["114","尾西","ﾋﾞｻｲ           ",15]
["115","大森","ｵｵﾓﾘ           ",15]
["116","池上","ｲｹｶﾞﾐ          ",15]
["117","蒲田","ｶﾏﾀ            ",15]
["118","羽田","ﾊﾈﾀﾞ           ",15]
["119","長原","ﾅｶﾞﾊﾗ          ",15]
["121","南浦和","ﾐﾅﾐｳﾗﾜ         ",15]
["123","横浜中山","ﾖｺﾊﾏﾅｶﾔﾏ       ",15]
["124","東戸塚","ﾋｶﾞｼﾄﾂｶ        ",15]
["125","練馬平和台","ﾈﾘﾏﾍｲﾜﾀﾞｲ      ",15]
["126","昭島","ｱｷｼﾏ           ",15]
["127","下北沢","ｼﾓｷﾀｻﾞﾜ        ",15]
["128","久我山駅前","ｸｶﾞﾔﾏｴｷﾏｴ      ",15]
["129","田園調布駅前","ﾃﾞﾝｴﾝﾁﾖｳﾌｴｷﾏｴ  ",15]
["130","世田谷","ｾﾀｶﾞﾔ          ",15]
["131","玉川","ﾀﾏｶﾞﾜ          ",15]
["132","成城","ｾｲｼﾞﾖｳ         ",15]
["133","表参道","ｵﾓﾃｻﾝﾄﾞｳ       ",15]
["134","橿原","ｶｼﾊﾗ           ",15]
["135","渋谷","ｼﾌﾞﾔ           ",15]
["136","恵比寿","ｴﾋﾞｽ           ",15]
["137","代々木上原","ﾖﾖｷﾞｳｴﾊﾗ       ",15]
["138","笹塚","ｻｻﾂﾞｶ          ",15]
["140","学芸大学駅前","ｶﾞｸﾀﾞｲﾏｴ       ",15]
["142","大泉学園","ｵｵｲｽﾞﾐｶﾞｸｴﾝ    ",15]
["143","四貫島","ｼｶﾝｼﾞﾏ         ",15]
["144","関西中央","ｶﾝｻｲﾁﾕｳｵｳ      ",{"$f":"LEN(C131)","v":15}]
["145","阪急梅田北","ﾊﾝｷﾕｳｳﾒﾀﾞｷﾀ    ",15]
["146","あかね","ｱｶﾈ            ",15]
["147","新東京","ｼﾝﾄｳｷﾖｳ        ",15]
["148","竹橋","ﾀｹﾊﾞｼ          ",15]
["149","仙川","ｾﾝｶﾞﾜ          ",15]
["150","名古屋営業部","ﾅｺﾞﾔ           ",15]
["151","中野","ﾅｶﾉ            ",15]
["152","東中野","ﾋｶﾞｼﾅｶﾉ        ",15]
["153","野方","ﾉｶﾞﾀ           ",15]
["154","白金","ｼﾛｶﾈ           ",15]
["155","高円寺","ｺｳｴﾝｼﾞ         ",15]
["156","阿佐ヶ谷","ｱｻｶﾞﾔ          ",15]
["157","荻窪","ｵｷﾞｸﾎﾞ         ",15]
["158","西荻窪駅前","ﾆｼｵｷﾞｸﾎﾞｴｷﾏｴ   ",15]
["160","上北沢","ｶﾐｷﾀｻﾞﾜ        ",15]
["161","橋本","ﾊｼﾓﾄ           ",15]
["162","浜田山出張所","ﾊﾏﾀﾞﾔﾏ         ",15]
["166","千住","ｾﾝｼﾞﾕ          ",15]
["167","成瀬","ﾅﾙｾ            ",15]
["168","田無","ﾀﾅｼ            ",15]
["169","塚本","ﾂｶﾓﾄ           ",15]
["170","西池袋","ﾆｼｲｹﾌﾞｸﾛ       ",15]
["171","大塚","ｵｵﾂｶ           ",15]
["172","東長崎","ﾋｶﾞｼﾅｶﾞｻｷ      ",15]
["173","池袋東口","ｲｹﾌﾞｸﾛﾋｶﾞｼｸﾞﾁ  ",15]
["174","目白駅前","ﾒｼﾞﾛｴｷﾏｴ       ",15]
["175","王子","ｵｳｼﾞ           ",15]
["176","滝野川","ﾀｷﾉｶﾞﾜ         ",15]
["177","赤羽駅前","ｱｶﾊﾞﾈｴｷﾏｴ      ",15]
["178","赤羽","ｱｶﾊﾞﾈ          ",15]
["180","日暮里","ﾆﾂﾎﾟﾘ          ",15]
["181","振込第三","ﾌﾘｺﾐﾀﾞｲｻﾝ      ",15]
["182","振込第四","ﾌﾘｺﾐﾀﾞｲﾖﾝ      ",15]
["183","帝京大病院出張所","ﾃｲｷﾖｳﾀﾞｲﾋﾞﾖｳｲﾝ ",15]
["185","新板橋","ｼﾝｲﾀﾊﾞｼ        ",15]
["186","志村","ｼﾑﾗ            ",15]
["187","大山","ｵｵﾔﾏ           ",15]
["188","下赤塚","ｼﾓｱｶﾂｶ         ",15]
["189","東海公務部","ﾄｳｶｲｺｳﾑﾌﾞ      ",15]
["190","江古田","ｴｺﾀﾞ           ",15]
["191","愛知県庁出張所","ｱｲﾁｹﾝﾁﾖｳ       ",15]
["192","名古屋市役所出張所","ﾅｺﾞﾔｼﾔｸｼﾖ      ",15]
["193","駒沢大学駅前","ｺﾏｻﾞﾜﾀﾞｲｶﾞｸｴｷﾏｴ",15]
["194","相模大野駅前","ｻｶﾞﾐｵｵﾉｴｷﾏｴ    ",15]
["195","千住中央","ｾﾝｼﾞﾕﾁﾕｳｵｳ     ",15]
["196","振込集中錦","ﾌﾘｺﾐｼﾕｳﾁﾕｳﾆｼｷ  ",15]
["197","こはる","ｺﾊﾙ            ",15]
["201","東大阪","ﾋｶﾞｼｵｵｻｶ       ",15]
["202","堺","ｻｶｲ            ",15]
["203","大津町","ｵｵﾂﾏﾁ          ",15]
["204","中央市場","ﾁﾕｳｵｳｲﾁﾊﾞ      ",15]
["205","堺東","ｻｶｲﾋｶﾞｼ        ",15]
["206","小岩","ｺｲﾜ            ",15]
["207","八尾","ﾔｵ             ",15]
["208","東","ﾋｶﾞｼ           ",15]
["209","天美出張所","ｱﾏﾐ            ",15]
["209","松原","ﾏﾂﾊﾞﾗ          ",15]
["210","和泉","ｲｽﾞﾐ           ",15]
["211","藤井寺","ﾌｼﾞｲﾃﾞﾗ        ",15]
["212","勝川","ｶﾁｶﾞﾜ          ",15]
["213","春日井","ｶｽｶﾞｲ          ",15]
["214","瀬戸","ｾﾄ             ",15]
["215","新横浜","ｼﾝﾖｺﾊﾏ         ",15]
["216","黒川","ｸﾛｶﾜ           ",{"$f":"LEN(C195)","v":15}]
["217","上飯田","ｶﾐｲｲﾀﾞ         ",15]
["218","吹田","ｽｲﾀ            ",15]
["219","茨木","ｲﾊﾞﾗｷ          ",15]
["220","吉祥寺","ｷﾁｼﾞﾖｳｼﾞ       ",15]
["221","名古屋駅前","ﾅｺﾞﾔｴｷﾏｴ       ",15]
["222","三鷹","ﾐﾀｶ            ",15]
["223","小金井","ｺｶﾞﾈｲ          ",15]
["224","柳橋","ﾔﾅｷﾞﾊﾞｼ        ",15]
["225","府中","ﾌﾁﾕｳ           ",15]
["226","八王子中央","ﾊﾁｵｳｼﾞﾁﾕｳｵｳ    ",15]
["227","立川","ﾀﾁｶﾜ           ",15]
["228","町田","ﾏﾁﾀﾞ           ",15]
["229","高槻","ﾀｶﾂｷ           ",15]
["230","大和田","ｵｵﾜﾀﾞ          ",15]
["231","久米川","ｸﾒｶﾞﾜ          ",15]
["232","日野豊田","ﾋﾉﾄﾖﾀﾞ         ",15]
["233","鶴川","ﾂﾙｶﾜ           ",15]
["234","蟹江","ｶﾆｴ            ",15]
["235","中村公園前","ﾅｶﾑﾗｺｳｴﾝﾏｴ     ",15]
["236","八戸ノ里","ﾔｴﾉｻﾄ          ",15]
["237","西春","ﾆｼﾊﾙ           ",15]
["238","小田井","ｵﾀｲ            ",15]
["239","光明池","ｺｳﾐﾖｳｲｹ        ",15]
["240","千里中央","ｾﾝﾘﾁﾕｳｵｳ       ",15]
["240","千里山田出張所","ｾﾝﾘﾔﾏﾀﾞ        ",15]
["241","保谷","ﾎｳﾔ            ",15]
["242","宮崎台","ﾐﾔｻﾞｷﾀﾞｲ       ",15]
["243","国立","ｸﾆﾀﾁ           ",15]
["244","阪神甲子園出張所","ﾊﾝｼﾝｺｳｼｴﾝ      ",15]
["245","多摩","ﾀﾏ             ",15]
["246","日野市役所","ﾋﾉｼﾔｸｼﾖ        ",15]
["247","河内長野","ｶﾜﾁﾅｶﾞﾉ        ",15]
["249","武蔵新城駅前","ﾑｻｼｼﾝｼﾞﾖｳｴｷﾏｴ  ",15]
["251","横浜駅前","ﾖｺﾊﾏｴｷﾏｴ       ",15]
["252","藤ヶ丘","ﾌｼﾞｶﾞｵｶ        ",15]
["253","川崎","ｶﾜｻｷ           ",15]
["254","元住吉","ﾓﾄｽﾐﾖｼ         ",15]
["255","鎌倉","ｶﾏｸﾗ           ",15]
["256","平塚駅前","ﾋﾗﾂｶｴｷﾏｴ       ",15]
["257","藤沢","ﾌｼﾞｻﾜ          ",15]
["258","登戸","ﾉﾎﾞﾘﾄ          ",15]
["259","相模原","ｻｶﾞﾐﾊﾗ         ",15]
["260","大和","ﾔﾏﾄ            ",15]
["261","茅ヶ崎","ﾁｶﾞｻｷ          ",15]
["262","上大岡","ｶﾐｵｵｵｶ         ",15]
["263","今池","ｲﾏｲｹ           ",15]
["264","覚王山","ｶｸｵｳｻﾞﾝ        ",15]
["265","本厚木","ﾎﾝｱﾂｷﾞ         ",15]
["266","八事","ﾔｺﾞﾄ           ",15]
["267","鶴舞","ﾂﾙﾏｲ           ",15]
["268","滝子","ﾀｷｺ            ",15]
["269","堀田","ﾎﾘﾀ            ",15]
["270","千葉","ﾁﾊﾞ            ",15]
["271","船橋","ﾌﾅﾊﾞｼ          ",15]
["272","八幡","ﾔﾜﾀ            ",15]
["273","鳴海","ﾅﾙﾐ            ",15]
["274","松戸西口","ﾏﾂﾄﾞﾆｼｸﾞﾁ      ",15]
["275","柏中央","ｶｼﾜﾁﾕｳｵｳ       ",15]
["276","星ヶ丘","ﾎｼｶﾞｵｶ         ",15]
["277","津田沼","ﾂﾀﾞﾇﾏ          ",15]
["278","石川橋","ｲｼｶﾜﾊﾞｼ        ",15]
["279","鎌ヶ谷","ｶﾏｶﾞﾔ          ",15]
["280","大和郡山","ﾔﾏﾄｺｵﾘﾔﾏ       ",15]
["281","栄町","ｻｶｴﾏﾁ          ",{"$f":"LEN(C259)","v":15}]
["282","上前津","ｶﾐﾏｴﾂﾞ         ",15]
["283","新稲毛","ｼﾝｲﾅｹﾞ         ",15]
["285","行徳","ｷﾞﾖｳﾄｸ         ",15]
["286","尾頭橋","ｵﾄｳﾊﾞｼ         ",15]
["288","金山","ｶﾅﾔﾏ           ",15]
["289","西川口","ﾆｼｶﾜｸﾞﾁ        ",15]
["290","大宮駅前","ｵｵﾐﾔｴｷﾏｴ       ",15]
["291","草加","ｿｳｶ            ",15]
["292","名古屋港","ﾅｺﾞﾔｺｳ         ",15]
["293","上尾","ｱｹﾞｵ           ",15]
["294","越谷駅前","ｺｼｶﾞﾔｴｷﾏｴ      ",15]
["295","所沢","ﾄｺﾛｻﾞﾜ         ",15]
["296","新座志木","ﾆｲｻﾞｼｷ         ",15]
["297","高畑","ﾀｶﾊﾞﾀ          ",15]
["298","坂戸","ｻｶﾄﾞ           ",15]
["299","鳴子","ﾅﾙｺ            ",15]
["300","東京公務部","ﾄｳｷﾖｳｺｳﾑﾌﾞ     ",15]
["301","一宮","ｲﾁﾉﾐﾔ          ",15]
["303","港北ニュータウン","ｺｳﾎｸﾆﾕ-ﾀｳﾝ     ",15]
["304","金沢文庫駅前","ｶﾅｻﾞﾜﾌﾞﾝｺｴｷﾏｴ  ",15]
["305","常滑","ﾄｺﾅﾒ           ",15]
["306","木曽川","ｷｿｶﾞﾜ          ",15]
["307","港南台","ｺｳﾅﾝﾀﾞｲ        ",15]
["308","大倉山","ｵｵｸﾗﾔﾏ         ",15]
["309","上永谷","ｶﾐﾅｶﾞﾔ         ",15]
["310","水戸","ﾐﾄ             ",15]
["311","東海","ﾄｳｶｲ           ",15]
["312","五香","ｺﾞｺｳ           ",15]
["313","振込第一","ﾌﾘｺﾐﾀﾞｲｲﾁ      ",15]
["314","仙台","ｾﾝﾀﾞｲ          ",15]
["315","東京女子医大出張所","ﾄｳｷﾖｳｼﾞﾖｼｲﾀﾞｲ  ",15]
["316","福生","ﾌﾂｻ            ",15]
["317","振込第二","ﾌﾘｺﾐﾀﾞｲﾆ       ",15]
["318","荏原","ｴﾊﾞﾗ           ",15]
["319","東松原","ﾋｶﾞｼﾏﾂﾊﾞﾗ      ",15]
["320","仙台中央","ｾﾝﾀﾞｲﾁﾕｳｵｳ     ",15]
["321","東京営業部","ﾄｳｷﾖｳｴｲｷﾞﾖｳﾌﾞ  ",15]
["322","堀留","ﾎﾘﾄﾞﾒ          ",15]
["323","小牧","ｺﾏｷ            ",15]
["324","京橋中央","ｷﾖｳﾊﾞｼﾁﾕｳｵｳ    ",15]
["325","銀座","ｷﾞﾝｻﾞ          ",15]
["326","月島","ﾂｷｼﾏ           ",15]
["327","札幌中央","ｻﾂﾎﾟﾛﾁﾕｳｵｳ     ",15]
["329","新宿新都心","ｼﾝｼﾞﾕｸｼﾝﾄｼﾝ    ",15]
["330","日比谷","ﾋﾋﾞﾔ           ",15]
["331","神田","ｶﾝﾀﾞ           ",15]
["332","虎ノ門中央","ﾄﾗﾉﾓﾝﾁﾕｳｵｳ     ",15]
["333","日本橋中央","ﾆﾎﾝﾊﾞｼﾁﾕｳｵｳ    ",15]
["335","上石神井","ｶﾐｼﾔｸｼﾞｲ       ",15]
["336","浅草","ｱｻｸｻ           ",15]
["337","上野","ｳｴﾉ            ",15]
["338","門前仲町","ﾓﾝｾﾞﾝﾅｶﾁﾖｳ     ",15]
["339","亀戸","ｶﾒｲﾄﾞ          ",15]
["340","四谷三丁目","ﾖﾂﾔｻﾝﾁﾖｳﾒ      ",15]
["341","新宿","ｼﾝｼﾞﾕｸ         ",15]
["343","中野駅南口","ﾅｶﾉｴｷﾐﾅﾐｸﾞﾁ    ",15]
["344","大府","ｵｵﾌﾞ           ",15]
["345","渋谷中央","ｼﾌﾞﾔﾁﾕｳｵｳ      ",15]
["346","阿佐ケ谷駅前","ｱｻｶﾞﾔｴｷﾏｴ      ",15]
["347","永福町","ｴｲﾌｸﾁﾖｳ        ",15]
["348","新橋駅前","ｼﾝﾊﾞｼｴｷﾏｴ      ",15]
["349","尾山台","ｵﾔﾏﾀﾞｲ         ",15]
["350","大泉","ｵｵｲｽﾞﾐ         ",15]
["351","本郷","ﾎﾝｺﾞｳ          ",{"$f":"LEN(C323)","v":15}]
["352","押上駅前","ｵｼｱｹﾞｴｷﾏｴ      ",15]
["353","本所","ﾎﾝｼﾞﾖ          ",15]
["354","葛飾","ｶﾂｼｶ           ",15]
["355","祐天寺","ﾕｳﾃﾝｼﾞ         ",15]
["357","大井町","ｵｵｲﾏﾁ          ",15]
["358","烏山","ｶﾗｽﾔﾏ          ",15]
["359","池袋","ｲｹﾌﾞｸﾛ         ",15]
["360","三河島","ﾐｶﾜｼﾏ          ",15]
["361","浦安","ｳﾗﾔｽ           ",15]
["362","蒲田駅前","ｶﾏﾀｴｷﾏｴ        ",15]
["363","静岡","ｼｽﾞｵｶ          ",15]
["364","大久保","ｵｵｸﾎﾞ          ",15]
["365","吉祥寺駅前","ｷﾁｼﾞﾖｳｼﾞｴｷﾏｴ   ",15]
["366","武蔵境駅前","ﾑｻｼｻｶｲｴｷﾏｴ     ",15]
["367","八王子","ﾊﾁｵｳｼﾞ         ",15]
["368","世田谷上町","ｾﾀｶﾞﾔｶﾐﾏﾁ      ",15]
["369","雷門","ｶﾐﾅﾘﾓﾝ         ",15]
["370","川崎駅前","ｶﾜｻｷｴｷﾏｴ       ",15]
["371","横浜中央","ﾖｺﾊﾏﾁﾕｳｵｳ      ",15]
["372","枇杷島","ﾋﾞﾜｼﾞﾏ         ",15]
["373","横浜白楽","ﾖｺﾊﾏﾊｸﾗｸ       ",15]
["374","横浜西口","ﾖｺﾊﾏﾆｼｸﾞﾁ      ",15]
["375","武蔵小杉","ﾑｻｼｺｽｷﾞ        ",15]
["376","鶴見駅前","ﾂﾙﾐｴｷﾏｴ        ",15]
["377","金町","ｶﾅﾏﾁ           ",15]
["378","戸塚駅前","ﾄﾂｶｴｷﾏｴ        ",15]
["379","相模原中央","ｻｶﾞﾐﾊﾗﾁﾕｳｵｳ    ",15]
["380","志木駅前","ｼｷｴｷﾏｴ         ",15]
["381","越谷","ｺｼｶﾞﾔ          ",15]
["382","川越","ｶﾜｺﾞｴ          ",15]
["383","蕨","ﾜﾗﾋﾞ           ",15]
["384","大宮","ｵｵﾐﾔ           ",15]
["385","千葉中央","ﾁﾊﾞﾁﾕｳｵｳ       ",15]
["386","松戸","ﾏﾂﾄﾞ           ",15]
["387","市川八幡","ｲﾁｶﾜﾔﾜﾀ        ",15]
["388","船橋駅前","ﾌﾅﾊﾞｼｴｷﾏｴ      ",15]
["389","エイティエム統括","ｴｲﾃｲｴﾑﾄｳｶﾂ     ",15]
["390","大船","ｵｵﾌﾅ           ",15]
["391","春日部駅前","ｶｽｶﾍﾞｴｷﾏｴ      ",15]
["392","津田沼東","ﾂﾀﾞﾇﾏﾋｶﾞｼ      ",15]
["393","稲沢","ｲﾅｻﾞﾜ          ",15]
["394","金沢中央","ｶﾅｻﾞﾜﾁﾕｳｵｳ     ",15]
["400","浄心","ｼﾞﾖｳｼﾝ         ",15]
["401","名古屋中央","ﾅｺﾞﾔﾁﾕｳｵｳ      ",15]
["403","新名古屋駅前","ｼﾝﾅｺﾞﾔｴｷﾏｴ     ",15]
["404","豊田","ﾄﾖﾀ            ",15]
["404","豊田市役所出張所","ﾄﾖﾀｼﾔｸｼﾖ       ",15]
["405","熱田","ｱﾂﾀ            ",15]
["408","豊田南","ﾄﾖﾀﾐﾅﾐ         ",15]
["409","海老名","ｴﾋﾞﾅ           ",15]
["410","北岡崎","ｷﾀｵｶｻﾞｷ        ",15]
["411","刈谷","ｶﾘﾔ            ",15]
["412","知立","ﾁﾘﾕｳ           ",15]
["413","安城","ｱﾝｼﾞﾖｳ         ",15]
["414","高浜","ﾀｶﾊﾏ           ",15]
["415","小阪","ｺｻｶ            ",15]
["416","碧南","ﾍｷﾅﾝ           ",15]
["417","新瑞橋","ｱﾗﾀﾏﾊﾞｼ        ",15]
["418","三好","ﾐﾖｼ            ",15]
["420","三好ヶ丘出張所","ﾐﾖｼｶﾞｵｶ        ",15]
["421","石神井公園","ｼﾔｸｼﾞｲｺｳｴﾝ     ",15]
["422","新丸の内","ｼﾝﾏﾙﾉｳﾁ        ",15]
["423","東刈谷出張所","ﾋｶﾞｼｶﾘﾔ        ",15]
["424","弥富","ﾔﾄﾐ            ",{"$f":"LEN(C387)","v":15}]
["425","中部国際空港出張所","ﾁﾕｳﾌﾞｺｸｻｲｸｳｺｳ  ",15]
["426","新潟","ﾆｲｶﾞﾀ          ",15]
["427","富雄出張所","ﾄﾐｵ            ",15]
["428","三島","ﾐｼﾏ            ",15]
["429","船堀","ﾌﾅﾎﾞﾘ          ",15]
["430","室町","ﾑﾛﾏﾁ           ",15]
["431","京都","ｷﾖｳﾄ           ",15]
["431","京都市役所出張所","ｷﾖｳﾄｼﾔｸｼﾖ      ",15]
["432","豊中駅前","ﾄﾖﾅｶｴｷﾏｴ       ",15]
["433","新橋","ｼﾝﾊﾞｼ          ",15]
["434","京都駅前","ｷﾖｳﾄｴｷﾏｴ       ",15]
["435","狭山","ｻﾔﾏ            ",15]
["436","東寺","ﾄｳｼﾞ           ",15]
["440","半田","ﾊﾝﾀﾞ           ",15]
["441","西陣","ﾆｼｼﾞﾝ          ",15]
["442","国府","ｺｳ             ",15]
["443","向島","ﾑｺｳｼﾞﾏ         ",15]
["445","聖護院","ｼﾖｳｺﾞｲﾝ        ",15]
["446","東向日町","ﾋｶﾞｼﾑｺｳﾏﾁ      ",15]
["447","香里","ｺｳﾘ            ",15]
["448","洛西出張所","ﾗｸｻｲ           ",15]
["449","西尾","ﾆｼｵ            ",15]
["450","四日市中央","ﾖﾂｶｲﾁﾁﾕｳｵｳ     ",15]
["451","泉ケ丘","ｲｽﾞﾐｶﾞｵｶ       ",15]
["452","草津","ｸｻﾂ            ",15]
["453","神戸中央","ｺｳﾍﾞﾁﾕｳｵｳ      ",15]
["454","柏","ｶｼﾜ            ",15]
["455","大和高田","ﾔﾏﾄﾀｶﾀﾞ        ",15]
["456","中もず","ﾅｶﾓｽﾞ          ",15]
["457","大和王寺","ﾔﾏﾄｵｳｼﾞ        ",15]
["458","近鉄学園前","ｷﾝﾃﾂｶﾞｸｴﾝﾏｴ    ",15]
["459","練馬","ﾈﾘﾏ            ",15]
["461","豊橋","ﾄﾖﾊｼ           ",15]
["461","豊橋市役所出張所","ﾄﾖﾊｼｼﾔｸｼﾖ      ",15]
["462","三宮","ｻﾝﾉﾐﾔ          ",15]
["463","小松川","ｺﾏﾂｶﾞﾜ         ",15]
["464","武蔵境","ﾑｻｼｻｶｲ         ",15]
["465","蒲郡","ｶﾞﾏｺﾞｵﾘ        ",15]
["467","渥美出張所","ｱﾂﾐ            ",15]
["467","田原","ﾀﾊﾗ            ",15]
["468","沼津","ﾇﾏﾂﾞ           ",15]
["469","新宿中央","ｼﾝｼﾞﾕｸﾁﾕｳｵｳ    ",15]
["470","渋谷明治通","ｼﾌﾞﾔﾒｲｼﾞﾄﾞｵﾘ   ",15]
["471","豊橋南出張所","ﾄﾖﾊｼﾐﾅﾐ        ",15]
["472","尼崎","ｱﾏｶﾞｻｷ         ",15]
["473","杭瀬","ｸｲｾ            ",15]
["474","塚口","ﾂｶｸﾞﾁ          ",15]
["474","武庫之荘出張所","ﾑｺﾉｿｳ          ",15]
["475","第二リテールアカウント","ﾀﾞｲﾆﾘﾃ-ﾙｱｶｳﾝﾄ  ",15]
["477","伊丹","ｲﾀﾐ            ",15]
["478","ＧＳＣ東京","ｼﾞ-ｴｽｼ-ﾄｳｷﾖｳ   ",15]
["479","西宮","ﾆｼﾉﾐﾔ          ",15]
["480","横浜","ﾖｺﾊﾏ           ",15]
["481","夙川","ｼﾕｸｶﾞﾜ         ",15]
["482","豊川","ﾄﾖｶﾜ           ",15]
["483","芦屋","ｱｼﾔ            ",15]
["484","成田空港","ﾅﾘﾀｸｳｺｳ        ",15]
["485","宝塚中山","ﾀｶﾗﾂﾞｶﾅｶﾔﾏ     ",15]
["486","成田空港第２ビル出張所","ﾅﾘﾀｸｳｺｳﾀﾞｲﾆﾋﾞﾙ ",15]
["487","逆瀬川出張所","ｻｶｾｶﾞﾜ         ",15]
["488","高松","ﾀｶﾏﾂ           ",15]
["489","岡本駅前","ｵｶﾓﾄｴｷﾏｴ       ",15]
["490","宝塚","ﾀｶﾗﾂﾞｶ         ",15]
["491","田辺","ﾀﾅﾍﾞ           ",{"$f":"LEN(C451)","v":15}]
["492","東神戸","ﾋｶﾞｼｺｳﾍﾞ       ",15]
["494","西明石特別出張所","ﾆｼｱｶｼ          ",15]
["495","明石","ｱｶｼ            ",15]
["496","姫路","ﾋﾒｼﾞ           ",15]
["497","和歌山","ﾜｶﾔﾏ           ",15]
["498","宇部","ｳﾍﾞ            ",15]
["499","くずは","ｸｽﾞﾊ           ",15]
["500","横浜藤が丘","ﾖｺﾊﾏﾌｼﾞｶﾞｵｶ    ",15]
["501","京都中央","ｷﾖｳﾄﾁﾕｳｵｳ      ",15]
["503","亀有駅前","ｶﾒｱﾘｴｷﾏｴ       ",15]
["504","西院","ｻｲｲﾝ           ",15]
["505","和光","ﾜｺｳ            ",15]
["506","出町","ﾃﾞﾏﾁ           ",15]
["507","金沢","ｶﾅｻﾞﾜ          ",15]
["508","伏見","ﾌｼﾐ            ",15]
["509","湘南台","ｼﾖｳﾅﾝﾀﾞｲ       ",15]
["510","所沢中央","ﾄｺﾛｻﾞﾜﾁﾕｳｵｳ    ",15]
["511","広島","ﾋﾛｼﾏ           ",15]
["512","国立駅前","ｸﾆﾀﾁｴｷﾏｴ       ",15]
["513","住吉","ｽﾐﾖｼ           ",15]
["514","都立大学駅北","ﾄﾘﾂﾀﾞｲｶﾞｸｴｷｷﾀ  ",15]
["516","二子玉川","ﾌﾀｺﾀﾏｶﾞﾜ       ",15]
["517","さんだ","ｻﾝﾀﾞ           ",15]
["518","大阪ビジネスローン部","ｵｵｻｶﾋﾞｼﾞﾈｽﾛ-ﾝﾌﾞ",15]
["519","田口特別出張所","ﾀｸﾞﾁ           ",15]
["520","大阪中央","ｵｵｻｶﾁﾕｳｵｳ      ",15]
["521","船場中央","ｾﾝﾊﾞﾁﾕｳｵｳ      ",15]
["522","府中駅前","ﾌﾁﾕｳｴｷﾏｴ       ",15]
["523","新大阪北","ｼﾝｵｵｻｶｷﾀ       ",15]
["524","ビジネスローン部","ﾋﾞｼﾞﾈｽﾛ-ﾝﾌﾞ    ",15]
["525","三鷹中央","ﾐﾀｶﾁﾕｳｵｳ       ",15]
["526","学園前北口","ｶﾞｸｴﾝﾏｴｷﾀｸﾞﾁ   ",15]
["527","京阪京橋","ｹｲﾊﾝｷﾖｳﾊﾞｼ     ",15]
["528","練馬駅前","ﾈﾘﾏｴｷﾏｴ        ",15]
["529","日吉駅前","ﾋﾖｼｴｷﾏｴ        ",15]
["530","梅田中央","ｳﾒﾀﾞﾁﾕｳｵｳ      ",15]
["531","津","ﾂ              ",15]
["532","松阪","ﾏﾂｻﾞｶ          ",15]
["533","天満","ﾃﾝﾏ            ",15]
["534","四日市","ﾖﾂｶｲﾁ          ",15]
["536","桑名","ｸﾜﾅ            ",15]
["537","五反田","ｺﾞﾀﾝﾀﾞ         ",15]
["538","大山田出張所","ｵｵﾔﾏﾀﾞ         ",15]
["540","西心斎橋","ﾆｼｼﾝｻｲﾊﾞｼ      ",15]
["541","難波駅前","ﾅﾝﾊﾞｴｷﾏｴ       ",15]
["542","上六","ｳｴﾛｸ           ",15]
["543","本店第一出張所","ﾎﾝﾃﾝﾀﾞｲｲﾁ      ",15]
["544","聖蹟桜ヶ丘","ｾｲｾｷｻｸﾗｶﾞｵｶ    ",15]
["545","大阪西","ｵｵｻｶﾆｼ         ",15]
["546","徳島","ﾄｸｼﾏ           ",15]
["547","津島","ﾂｼﾏ            ",15]
["548","田無駅前","ﾀﾅｼｴｷﾏｴ        ",15]
["549","新城","ｼﾝｼﾛ           ",15]
["550","岐阜","ｷﾞﾌ            ",15]
["551","今里北","ｲﾏｻﾞﾄｷﾀ        ",15]
["552","中野駅前","ﾅｶﾉｴｷﾏｴ        ",15]
["553","リテールアカウント","ﾘﾃ-ﾙｱｶｳﾝﾄ      ",15]
["554","船堀駅前","ﾌﾅﾎﾞﾘｴｷﾏｴ      ",15]
["555","阿倍野橋西","ｱﾍﾞﾉﾊﾞｼﾆｼ      ",15]
["556","北畠","ｷﾀﾊﾞﾀｹ         ",15]
["557","国分寺","ｺｸﾌﾞﾝｼﾞ        ",15]
["558","浜松町","ﾊﾏﾏﾂﾁﾖｳ        ",15]
["559","知多","ﾁﾀ             ",15]
["561","静岡中央","ｼｽﾞｵｶﾁﾕｳｵｳ     ",{"$f":"LEN(C515)","v":15}]
["562","名古屋ＢＬ部出張所","ﾅｺﾞﾔﾋﾞ-ｴﾙﾌﾞ    ",15]
["563","浜松","ﾊﾏﾏﾂ           ",15]
["564","茗荷谷出張所","ﾐﾖｳｶﾞﾀﾞﾆ       ",15]
["567","久我山","ｸｶﾞﾔﾏ          ",15]
["568","池袋西口","ｲｹﾌﾞｸﾛﾆｼｸﾞﾁ    ",15]
["569","トラスト","ﾄﾗｽﾄ           ",15]
["570","麻布","ｱｻﾞﾌﾞ          ",15]
["571","福岡中央","ﾌｸｵｶﾁﾕｳｵｳ      ",15]
["572","門真","ｶﾄﾞﾏ           ",15]
["573","茨木駅前","ｲﾊﾞﾗｷｴｷﾏｴ      ",15]
["574","八尾駅前","ﾔｵｴｷﾏｴ         ",15]
["575","高槻駅前","ﾀｶﾂｷｴｷﾏｴ       ",15]
["576","堺駅前","ｻｶｲｴｷﾏｴ        ",15]
["577","千里中央駅前","ｾﾝﾘﾁﾕｳｵｳｴｷﾏｴ   ",15]
["578","江坂駅前","ｴｻｶｴｷﾏｴ        ",15]
["579","交野","ｶﾀﾉ            ",15]
["580","尼崎駅前","ｱﾏｶﾞｻｷｴｷﾏｴ     ",15]
["581","神戸","ｺｳﾍﾞ           ",15]
["582","キャッスルタウン","ｷﾔﾂｽﾙﾀｳﾝ       ",15]
["583","兵庫","ﾋﾖｳｺﾞ          ",15]
["584","姫路中央","ﾋﾒｼﾞﾁﾕｳｵｳ      ",15]
["585","芦屋北","ｱｼﾔｷﾀ          ",15]
["586","多治見","ﾀｼﾞﾐ           ",15]
["587","武豊","ﾀｹﾄﾖ           ",15]
["588","品川駅前","ｼﾅｶﾞﾜｴｷﾏｴ      ",15]
["589","荻窪駅前","ｵｷﾞｸﾎﾞｴｷﾏｴ     ",15]
["590","調布","ﾁﾖｳﾌ           ",15]
["591","多摩センター","ﾀﾏｾﾝﾀ-         ",15]
["592","立川中央","ﾀﾁｶﾜﾁﾕｳｵｳ      ",15]
["593","豊中","ﾄﾖﾅｶ           ",15]
["594","羽衣","ﾊｺﾞﾛﾓ          ",15]
["596","亀有","ｶﾒｱﾘ           ",15]
["597","草加新田","ｿｳｶｼﾝﾃﾞﾝ       ",15]
["601","岡山駅前","ｵｶﾔﾏｴｷﾏｴ       ",15]
["602","福山","ﾌｸﾔﾏ           ",15]
["603","広島中央","ﾋﾛｼﾏﾁﾕｳｵｳ      ",15]
["604","徳山","ﾄｸﾔﾏ           ",15]
["605","土浦","ﾂﾁｳﾗ           ",15]
["606","入間","ｲﾙﾏ            ",15]
["607","浦安駅前","ｳﾗﾔｽｴｷﾏｴ       ",15]
["608","青山","ｱｵﾔﾏ           ",15]
["609","赤坂","ｱｶｻｶ           ",15]
["610","東恵比寿","ﾋｶﾞｼｴﾋﾞｽ       ",15]
["611","鷹の台出張所","ﾀｶﾉﾀﾞｲ         ",15]
["612","八千代","ﾔﾁﾖ            ",15]
["613","鷺沼","ｻｷﾞﾇﾏ          ",15]
["614","葛西","ｶｻｲ            ",15]
["615","五反田駅前","ｺﾞﾀﾝﾀﾞｴｷﾏｴ     ",15]
["616","麹町","ｺｳｼﾞﾏﾁ         ",15]
["617","高島平","ﾀｶｼﾏﾀﾞｲﾗ       ",15]
["618","大井","ｵｵｲ            ",15]
["619","市川","ｲﾁｶﾜ           ",15]
["620","高松中央","ﾀｶﾏﾂﾁﾕｳｵｳ      ",15]
["621","鶴見","ﾂﾙﾐ            ",15]
["622","練馬光が丘","ﾈﾘﾏﾋｶﾘｶﾞｵｶ     ",15]
["623","町田駅前","ﾏﾁﾀﾞｴｷﾏｴ       ",15]
["624","関西空港出張所","ｶﾝｻｲｸｳｺｳ       ",15]
["626","秋葉原","ｱｷﾊﾊﾞﾗ         ",15]
["627","原宿","ﾊﾗｼﾞﾕｸ         ",15]
["628","逗子","ｽﾞｼ            ",15]
["629","たまプラーザ","ﾀﾏﾌﾟﾗ-ｻﾞ       ",15]
["630","春日部","ｶｽｶﾍﾞ          ",15]
["631","西葛西","ﾆｼｶｻｲ          ",15]
["634","木場深川","ｷﾊﾞﾌｶｶﾞﾜ       ",{"$f":"LEN(C579)","v":15}]
["635","戸塚","ﾄﾂｶ            ",15]
["637","札幌","ｻﾂﾎﾟﾛ          ",15]
["638","新松戸","ｼﾝﾏﾂﾄﾞ         ",15]
["640","綱島","ﾂﾅｼﾏ           ",15]
["641","目白","ﾒｼﾞﾛ           ",15]
["642","下赤塚駅前","ｼﾓｱｶﾂｶｴｷﾏｴ     ",15]
["643","中目黒","ﾅｶﾒｸﾞﾛ         ",15]
["644","大森駅前","ｵｵﾓﾘｴｷﾏｴ       ",15]
["646","西新宿","ﾆｼｼﾝｼﾞﾕｸ       ",15]
["647","成城学園前","ｾｲｼﾞﾖｳｶﾞｸｴﾝﾏｴ  ",15]
["648","志村坂上","ｼﾑﾗｻｶｳｴ        ",15]
["649","中目黒駅前","ﾅｶﾒｸﾞﾛｴｷﾏｴ     ",15]
["650","北九州","ｷﾀｷﾕｳｼﾕｳ       ",15]
["651","枚方","ﾋﾗｶﾀ           ",15]
["652","福岡","ﾌｸｵｶ           ",15]
["653","三田","ﾐﾀ             ",15]
["654","長崎","ﾅｶﾞｻｷ          ",15]
["655","熊本","ｸﾏﾓﾄ           ",15]
["656","武蔵新城","ﾑｻｼｼﾝｼﾞﾖｳ      ",15]
["657","高田馬場駅前","ﾀｶﾀﾉﾊﾞﾊﾞｴｷﾏｴ   ",15]
["658","大山駅前","ｵｵﾔﾏｴｷﾏｴ       ",15]
["660","中村","ﾅｶﾑﾗ           ",15]
["661","竹ノ塚","ﾀｹﾉﾂｶ          ",15]
["663","六番町","ﾛｸﾊﾞﾝﾁﾖｳ       ",15]
["664","飯田橋","ｲｲﾀﾞﾊﾞｼ        ",15]
["666","秋葉原駅前","ｱｷﾊﾊﾞﾗｴｷﾏｴ     ",15]
["669","浦和","ｳﾗﾜ            ",15]
["670","本山","ﾓﾄﾔﾏ           ",15]
["671","木更津","ｷｻﾗﾂﾞ          ",15]
["672","二俣川","ﾌﾀﾏﾀｶﾞﾜ        ",15]
["673","横須賀","ﾖｺｽｶ           ",15]
["675","国分寺駅前","ｺｸﾌﾞﾝｼﾞｴｷﾏｴ    ",15]
["677","笹島","ｻｻｼﾞﾏ          ",15]
["678","カブドットコム","ｶﾌﾞﾄﾞﾂﾄｺﾑ      ",15]
["680","目黒","ﾒｸﾞﾛ           ",15]
["682","永福町駅前","ｴｲﾌｸﾁﾖｳｴｷﾏｴ    ",15]
["683","猪子石","ｲﾉｺｲｼ          ",15]
["685","東松山","ﾋｶﾞｼﾏﾂﾔﾏ       ",15]
["686","徳重","ﾄｸｼｹﾞ          ",15]
["693","大曽根","ｵｵｿﾞﾈ          ",15]
["694","笠寺","ｶｻﾃﾞﾗ          ",15]
["697","野並","ﾉﾅﾐ            ",15]
["700","三軒茶屋","ｻﾝｹﾞﾝﾁﾞﾔﾔ      ",15]
["702","中山","ﾅｶﾔﾏ           ",15]
["704","犬山","ｲﾇﾔﾏ           ",15]
["707","厚木","ｱﾂｷﾞ           ",15]
["709","金沢文庫","ｶﾅｻﾞﾜﾌﾞﾝｺ      ",15]
["710","泉佐野","ｲｽﾞﾐｻﾉ         ",15]
["713","志津","ｼﾂﾞ            ",15]
["717","箕面","ﾐﾉｵ            ",15]
["718","岡崎駅前","ｵｶｻﾞｷｴｷﾏｴ      ",15]
["719","奈良","ﾅﾗ             ",15]
["720","調布南","ﾁﾖｳﾌﾐﾅﾐ        ",15]
["723","蓮田","ﾊｽﾀﾞ           ",15]
["724","草加駅前","ｿｳｶｴｷﾏｴ        ",15]
["727","和光駅前","ﾜｺｳｴｷﾏｴ        ",15]
["728","青葉台","ｱｵﾊﾞﾀﾞｲ        ",15]
["732","南藤沢","ﾐﾅﾐﾌｼﾞｻﾜ       ",15]
["738","祖父江","ｿﾌﾞｴ           ",15]
["740","岡崎","ｵｶｻﾞｷ          ",15]
["741","岡山","ｵｶﾔﾏ           ",15]
["744","新小岩","ｼﾝｺｲﾜ          ",15]
["745","日進","ﾆﾂｼﾝ           ",15]
["748","西荻窪","ﾆｼｵｷﾞｸﾎﾞ       ",{"$f":"LEN(C643)","v":15}]
["749","新富町","ｼﾝﾄﾐﾁﾖｳ        ",15]
["752","植田","ｳｴﾀﾞ           ",15]
["753","ブラデスコ","ﾌﾞﾗﾃﾞｽｺ        ",15]
["754","公共第一","ｺｳｷﾖｳﾀﾞｲｲﾁ     ",15]
["755","ビジネスアカウント","ﾋﾞｼﾞﾈｽｱｶｳﾝﾄ    ",15]
["756","豊明","ﾄﾖｱｹ           ",15]
["757","高蔵寺","ｺｳｿﾞｳｼﾞ        ",15]
["758","ひいらぎ","ﾋｲﾗｷﾞ          ",15]
["760","きさらぎ","ｷｻﾗｷﾞ          ",15]
["762","用賀出張所","ﾖｳｶﾞ           ",15]
["763","王子駅前","ｵｳｼﾞｴｷﾏｴ       ",15]
["764","インターネット","ｲﾝﾀ-ﾈﾂﾄ        ",15]
["765","久留米","ｸﾙﾒ            ",15]
["766","富田林","ﾄﾝﾀﾞﾊﾞﾔｼ       ",15]
["767","相模大野","ｻｶﾞﾐｵｵﾉ        ",15]
["769","守山","ﾓﾘﾔﾏ           ",15]
["770","巣鴨","ｽｶﾞﾓ           ",15]
["772","柴田","ｼﾊﾞﾀ           ",15]
["777","くすのき","ｸｽﾉｷ           ",15]
["780","岸和田","ｷｼﾜﾀﾞ          ",15]
["784","有松出張所","ｱﾘﾏﾂ           ",15]
["785","平塚","ﾋﾗﾂｶ           ",15]
["786","中津川","ﾅｶﾂｶﾞﾜ         ",15]
["787","大美野","ｵｵﾐﾉ           ",15]
["788","磐田","ｲﾜﾀ            ",15]
["789","大正橋","ﾀｲｼﾖｳﾊﾞｼ       ",15]
["790","池田","ｲｹﾀﾞ           ",15]
["790","日生中央出張所","ﾆﾂｾｲﾁﾕｳｵｳ      ",15]
["792","内田橋","ｳﾁﾀﾞﾊﾞｼ        ",15]
["793","大垣","ｵｵｶﾞｷ          ",15]
["794","自由が丘","ｼﾞﾕｳｶﾞｵｶ       ",15]
["795","甲子園","ｺｳｼｴﾝ          ",15]
["796","尾張旭","ｵﾜﾘｱｻﾋ         ",15]
["797","守口","ﾓﾘｸﾞﾁ          ",15]
["798","錦糸町駅前","ｷﾝｼﾁﾖｳｴｷﾏｴ     ",15]
["799","市川駅前","ｲﾁｶﾜｴｷﾏｴ       ",15]
["800","岩倉","ｲﾜｸﾗ           ",15]
["802","うみかぜ","ｳﾐｶｾﾞ          ",15]
["804","きよなみ","ｷﾖﾅﾐ           ",15]
["805","やまびこ","ﾔﾏﾋﾞｺ          ",15]
["807","はつはる","ﾊﾂﾊﾙ           ",15]
["809","わかたけ","ﾜｶﾀｹ           ",15]
["814","めいげつ","ﾒｲｹﾞﾂ          ",15]
["820","長田","ﾅｶﾞﾀ           ",15]
["822","新大阪","ｼﾝｵｵｻｶ         ",15]
["824","豊中庄内","ﾄﾖﾅｶｼﾖｳﾅｲ      ",15]
["825","大阪京橋","ｵｵｻｶｷﾖｳﾊﾞｼ     ",15]
["826","東大阪中央","ﾋｶﾞｼｵｵｻｶﾁﾕｳｵｳ  ",15]
["829","摂津","ｾﾂﾂ            ",15]
["830","江南","ｺｳﾅﾝ           ",15]
["831","ニコス振込","ﾆｺｽﾌﾘｺﾐ        ",15]
["833","一宮東","ｲﾁﾉﾐﾔﾋｶﾞｼ      ",15]
["847","振込用カブドットコム","ﾌﾘｺﾐﾖｳｶﾌﾞﾄﾞﾂﾄｺﾑ",15]
["848","しらゆき","ｼﾗﾕｷ           ",15]
["849","あさぎり","ｱｻｷﾞﾘ          ",15]
["851","いちょう","ｲﾁﾖｳ           ",15]
["855","あけぼの","ｱｹﾎﾞﾉ          ",15]
["860","しおさい","ｼｵｻｲ           ",15]
["862","すずかぜ","ｽｽﾞｶｾﾞ         ",15]
["864","西七条","ﾆｼﾅﾅｼﾞﾖｳ       ",15]
["865","せいうん","ｾｲｳﾝ           ",15]
["867","みかづき","ﾐｶﾂﾞｷ          ",15]
["868","すいせい","ｽｲｾｲ           ",15]
["869","なつぐも","ﾅﾂｸﾞﾓ          ",{"$f":"LEN(C707)","v":15}]
["870","うぐいす","ｳｸﾞｲｽ          ",15]
["871","ききょう","ｷｷﾖｳ           ",15]
["872","はるかぜ","ﾊﾙｶｾﾞ          ",15]
["873","三菱ＵＦＪＭＳ証券振込","ﾐﾂﾋﾞｼUFJMSｼﾖｳｹﾝ",15]
["875","そうげん","ｿｳｹﾞﾝ          ",15]
["877","公共第二","ｺｳｷﾖｳﾀﾞｲﾆ      ",15]
["879","ふうげつ","ﾌｳｹﾞﾂ          ",15]
["883","岡三証券振込","ｵｶｻﾝｼﾖｳｹﾝﾌﾘｺﾐ  ",15]
["885","花園","ﾊﾅｿﾞﾉ          ",15]
["894","尾張新川","ｵﾜﾘｼﾝｶﾜ        ",15]
["894","甚目寺出張所","ｼﾞﾓｸｼﾞ         ",15]
["895","板橋","ｲﾀﾊﾞｼ          ",15]
["899","東海東京証券振込","ﾄｳｶｲﾄｳｷﾖｳｼﾖｳｹﾝ ",15]
["900","ネットデローン","ﾈﾂﾄﾃﾞﾛ-ﾝ       ",15]
["965","ゆうがお","ﾕｳｶﾞｵ          ",15]
["967","バンクイック振込","ﾊﾞﾝｸｲﾂｸﾌﾘｺﾐ    ",15]

{"sheet":"社員データ","index":2,"n_rows":11,"n_cols":10,"rows_kept":11,"cut":false,"hidden":false,"merged":[]}
["社員番号\n(C10)","社員氏名","社員氏名\n(ｶﾅ)(C30)","銀行\nｺｰﾄﾞ","銀行名(ｶﾅ)\n(C15)","支店\n番号","支店名(ｶﾅ)","預金\n種目","口座番号\n(N7)","社員名(ｶﾅ)\n文字数"]
[11111111,"三菱太郎","ﾐﾂﾋﾞｼﾀﾛｳ                      ","005","ﾐﾂﾋﾞｼﾄｳｷﾖｳUFJ  ","001",{"$f":"VLOOKUP(F2,'支店コード '!$A$2:$C$723,3,FALSE)","v":"ﾎﾝﾃﾝ           "},1,111111,{"$f":"LEN(C2)","v":30}]
[22222222,"UFJ太郎","UFJﾀﾛｳ                        ","005","ﾐﾂﾋﾞｼﾄｳｷﾖｳUFJ  ","005",{"$f":"VLOOKUP(F3,'支店コード '!$A$2:$C$723,3,FALSE)","v":"ｵｵｻｶ           "},1,222222,30]
[33333333,"東京太郎","ﾄｳｷﾖｳﾀﾛｳ                      ","005","ﾐﾂﾋﾞｼﾄｳｷﾖｳUFJ  ","150",{"$f":"VLOOKUP(F4,'支店コード '!$A$2:$C$723,3,FALSE)","v":"ﾅｺﾞﾔ           "},1,333333,30]
[44444444,"日本太郎","ﾆﾂﾎﾟﾝﾀﾛｳ                      ","005","ﾐﾂﾋﾞｼﾄｳｷﾖｳUFJ  ","333",{"$f":"VLOOKUP(F5,'支店コード '!$A$2:$C$723,3,FALSE)","v":"ﾆﾎﾝﾊﾞｼﾁﾕｳｵｳ    "},1,444444,30]
[55555555,"大阪太郎","ｵｵｻｶﾀﾛｳ                       ","005","ﾐﾂﾋﾞｼﾄｳｷﾖｳUFJ  ","213",{"$f":"VLOOKUP(F6,'支店コード '!$A$2:$C$723,3,FALSE)","v":"ｶｽｶﾞｲ          "},1,555555,30]
[66666666,"名古屋太郎","ﾅｺﾞﾔﾀﾛｳ                       ","005","ﾐﾂﾋﾞｼﾄｳｷﾖｳUFJ  ","498",{"$f":"VLOOKUP(F7,'支店コード '!$A$2:$C$723,3,FALSE)","v":"ｳﾍﾞ            "},1,666666,30]
[77777777,"札幌太郎","ｻﾂﾎﾟﾛﾀﾛｳ                      ","005","ﾐﾂﾋﾞｼﾄｳｷﾖｳUFJ  ","895",{"$f":"VLOOKUP(F8,'支店コード '!$A$2:$C$723,3,FALSE)","v":"ｲﾀﾊﾞｼ          "},1,777777,30]
[88888888,"福岡太郎","ﾌｸｵｶﾀﾛｳ                       ","005","ﾐﾂﾋﾞｼﾄｳｷﾖｳUFJ  ","777",{"$f":"VLOOKUP(F9,'支店コード '!$A$2:$C$723,3,FALSE)","v":"ｸｽﾉｷ           "},1,888888,30]
[99999999,"京都太郎","ｷﾖｳﾄﾀﾛｳ                       ","005","ﾐﾂﾋﾞｼﾄｳｷﾖｳUFJ  ","626",{"$f":"VLOOKUP(F10,'支店コード '!$A$2:$C$723,3,FALSE)","v":"ｱｷﾊﾊﾞﾗ         "},1,999999,30]
[12345678,"横浜太郎","ﾖｺﾊﾏﾀﾛｳ                       ","005","ﾐﾂﾋﾞｼﾄｳｷﾖｳUFJ  ","713",{"$f":"VLOOKUP(F11,'支店コード '!$A$2:$C$723,3,FALSE)","v":"ｼﾂﾞ            "},1,1234567,30]

{"sheet":"部門コード","index":3,"n_rows":10,"n_cols":2,"rows_kept":10,"cut":false,"hidden":false,"merged":[]}
["ｺｰﾄﾞ\n(C10)","名称"]
[1111,"本社"]
[2222,"大阪支社"]
[3333,"名古屋支店"]
[4444,"営業本部"]
[5555,"管理本部"]
[6666,"経営企画部"]
[7777,"総務人事部"]
[8888,"監査部"]
[9999,"役員"]

{"sheet":"支払データ","index":4,"n_rows":27,"n_cols":4,"rows_kept":27,"cut":false,"hidden":false,"merged":[]}
["受付日","振込日","部門コード","部署名"]
["2016-10-01","2016-10-05",1111,{"$f":"VLOOKUP(C2,部門コード!$A$2:$B$10,2,FALSE)","v":"本社"}]
[]
[null,"社員番号","社員氏名","支払金額"]
[1,11111111,{"$f":"VLOOKUP(B5,社員データ!$A$2:$B$11,2,FALSE)","v":"三菱太郎"},1111]
[2,22222222,{"$f":"VLOOKUP(B6,社員データ!$A$2:$B$11,2,FALSE)","v":"UFJ太郎"},2222]
[3,33333333,{"$f":"VLOOKUP(B7,社員データ!$A$2:$B$11,2,FALSE)","v":"東京太郎"},3333]
[4,44444444,{"$f":"VLOOKUP(B8,社員データ!$A$2:$B$11,2,FALSE)","v":"日本太郎"},4444]
[5,55555555,{"$f":"VLOOKUP(B9,社員データ!$A$2:$B$11,2,FALSE)","v":"大阪太郎"},5555]
[6,66666666,{"$f":"VLOOKUP(B10,社員データ!$A$2:$B$11,2,FALSE)","v":"名古屋太郎"},6666]
[7,77777777,{"$f":"VLOOKUP(B11,社員データ!$A$2:$B$11,2,FALSE)","v":"札幌太郎"},7777]
[8,88888888,{"$f":"VLOOKUP(B12,社員データ!$A$2:$B$11,2,FALSE)","v":"福岡太郎"},8888]
[9,99999999,{"$f":"VLOOKUP(B13,社員データ!$A$2:$B$11,2,FALSE)","v":"京都太郎"},9999]
[10,12345678,{"$f":"VLOOKUP(B14,社員データ!$A$2:$B$11,2,FALSE)","v":"横浜太郎"},1000]
[11,11111111,{"$f":"VLOOKUP(B15,社員データ!$A$2:$B$11,2,FALSE)","v":"三菱太郎"},1111]
[12,22222222,{"$f":"VLOOKUP(B16,社員データ!$A$2:$B$11,2,FALSE)","v":"UFJ太郎"},2222]
[13,33333333,{"$f":"VLOOKUP(B17,社員データ!$A$2:$B$11,2,FALSE)","v":"東京太郎"},3333]
[14,44444444,{"$f":"VLOOKUP(B18,社員データ!$A$2:$B$11,2,FALSE)","v":"日本太郎"},4444]
[15,55555555,{"$f":"VLOOKUP(B19,社員データ!$A$2:$B$11,2,FALSE)","v":"大阪太郎"},5555]
[16,66666666,{"$f":"VLOOKUP(B20,社員データ!$A$2:$B$11,2,FALSE)","v":"名古屋太郎"},6666]
[17,77777777,{"$f":"VLOOKUP(B21,社員データ!$A$2:$B$11,2,FALSE)","v":"札幌太郎"},7777]
[18,88888888,{"$f":"VLOOKUP(B22,社員データ!$A$2:$B$11,2,FALSE)","v":"福岡太郎"},8888]
[19,99999999,{"$f":"VLOOKUP(B23,社員データ!$A$2:$B$11,2,FALSE)","v":"京都太郎"},9999]
[20,12345678,{"$f":"VLOOKUP(B24,社員データ!$A$2:$B$11,2,FALSE)","v":"横浜太郎"},1000]
[]
[null,null,"合計件数",{"$f":"IF(COUNT(D5:D24)=0,\"\",COUNT(D5:D24))","v":20}]
[null,null,"合計金額",{"$f":"IF(SUM(D5:D24)=0,\"\",SUM(D5:D24))","v":101990}]

{"sheet":"全銀形式（データ)","index":5,"n_rows":23,"n_cols":18,"rows_kept":23,"cut":false,"hidden":false,"merged":[]}
[1,21,0,"1234567890",{"$f":"\"ﾅｲｱｶﾞﾗ.ｴｷｽﾌﾟﾚｽ.ﾄﾚｰﾄﾞ(ｶ\"&REPT(\" \",18)","v":"ﾅｲｱｶﾞﾗ.ｴｷｽﾌﾟﾚｽ.ﾄﾚｰﾄﾞ(ｶ                  "},{"$f":"TEXT(支払データ!$B$2,\"mmdd\")","v":"1005"},"0005",{"$f":"\"ﾐﾂﾋﾞｼﾄｳｷﾖｳUFJ\"&REPT(\" \",2)","v":"ﾐﾂﾋﾞｼﾄｳｷﾖｳUFJ  "},"001",{"$f":"\"ﾎﾝﾃﾝ\"&REPT(\" \", 11)","v":"ﾎﾝﾃﾝ           "},1,1234567,{"$f":"REPT(\" \",17)","v":"                 "}]
[8,{"$f":"IF(支払データ!D26=\"\",\"\",TEXT(支払データ!D26,\"000000\"))","v":"000020"},{"$f":"IF(支払データ!D27=\"\",\"\",TEXT(支払データ!D27,\"000000000000\"))","v":"000000101990"},{"$f":"REPT(\" \",101)","v":"                                                                                                     "}]
[9,{"$f":"REPT(\" \",119)","v":"                                                                                                                       "}]
[{"$f":"IF($J4=\"\",\"\",2)","v":2},{"$f":"IF(J4=\"\",\"\",\"0005\")","v":"0005"},{"$f":"IF($J4=\"\",\"\",\"ﾐﾂﾋﾞｼﾄｳｷﾖｳUFJ\"&REPT(\" \", 2))","v":"ﾐﾂﾋﾞｼﾄｳｷﾖｳUFJ  "},{"$f":"IF($R4=\"\",\"\",INDEX(社員データ!$A$2:$I$11,MATCH($R4,社員データ!$A$2:$A$11,0),6))","v":"001"},{"$f":"IF($R4=\"\",\"\",INDEX(社員データ!$A$2:$I$11,MATCH($R4,社員データ!$A$2:$A$11,0),7))","v":"ﾎﾝﾃﾝ           "},{"$f":"REPT(\" \",4)","v":"    "},{"$f":"IF($R4=\"\",\"\",INDEX(社員データ!$A$2:$I$11,MATCH($R4,社員データ!$A$2:$A$11,0),8))","v":1},{"$f":"IF($R4=\"\",\"\",TEXT(INDEX(社員データ!$A$2:$I$11,MATCH($R4,社員データ!$A$2:$A$11,0),9),\"0000000\"))","v":"0111111"},{"$f":"IF($R4=\"\",\"\",INDEX(社員データ!$A$2:$I$11,MATCH($R4,社員データ!$A$2:$A$11,0),3))","v":"ﾐﾂﾋﾞｼﾀﾛｳ                      "},{"$f":"IF(支払データ!$D5=\"\",\"\",TEXT(支払データ!$D5,\"0000000000\"))","v":"0000001111"},{"$f":"IF(J4=\"\",\"\",0)","v":0},{"$f":"IF(支払データ!$B5=\"\",\"\",TEXT(支払データ!$B5,\"0000000000\"))","v":"0011111111"},{"$f":"IF(支払データ!$C$2=\"\",\"\",TEXT(支払データ!$C$2,\"0000000000\"))","v":"0000001111"},{"$f":"IF(J4=\"\",\"\",7)","v":7},{"$f":"IF(J4=\"\",\"\",\"X\")","v":"X"},{"$f":"REPT(\" \",7)","v":"       "},null,{"$f":"IF(支払データ!$B5=\"\",\"\",支払データ!$B5)","v":11111111}]
[{"$f":"IF($J5=\"\",\"\",2)","v":2},{"$f":"IF(J5=\"\",\"\",\"0005\")","v":"0005"},{"$f":"IF($J5=\"\",\"\",\"ﾐﾂﾋﾞｼﾄｳｷﾖｳUFJ\"&REPT(\" \", 2))","v":"ﾐﾂﾋﾞｼﾄｳｷﾖｳUFJ  "},{"$f":"IF($R5=\"\",\"\",INDEX(社員データ!$A$2:$I$11,MATCH($R5,社員データ!$A$2:$A$11,0),6))","v":"005"},{"$f":"IF($R5=\"\",\"\",INDEX(社員データ!$A$2:$I$11,MATCH($R5,社員データ!$A$2:$A$11,0),7))","v":"ｵｵｻｶ           "},{"$f":"REPT(\" \",4)","v":"    "},{"$f":"IF($R5=\"\",\"\",INDEX(社員データ!$A$2:$I$11,MATCH($R5,社員データ!$A$2:$A$11,0),8))","v":1},{"$f":"IF($R5=\"\",\"\",TEXT(INDEX(社員データ!$A$2:$I$11,MATCH($R5,社員データ!$A$2:$A$11,0),9),\"0000000\"))","v":"0222222"},{"$f":"IF($R5=\"\",\"\",INDEX(社員データ!$A$2:$I$11,MATCH($R5,社員データ!$A$2:$A$11,0),3))","v":"UFJﾀﾛｳ                        "},{"$f":"IF(支払データ!$D6=\"\",\"\",TEXT(支払データ!$D6,\"0000000000\"))","v":"0000002222"},{"$f":"IF(J5=\"\",\"\",0)","v":0},{"$f":"IF(支払データ!$B6=\"\",\"\",TEXT(支払データ!$B6,\"0000000000\"))","v":"0022222222"},{"$f":"IF(支払データ!$C$2=\"\",\"\",TEXT(支払データ!$C$2,\"0000000000\"))","v":"0000001111"},{"$f":"IF(J5=\"\",\"\",7)","v":7},{"$f":"IF(J5=\"\",\"\",\"X\")","v":"X"},{"$f":"REPT(\" \",7)","v":"       "},null,{"$f":"IF(支払データ!$B6=\"\",\"\",支払データ!$B6)","v":22222222}]
[2,"0005","ﾐﾂﾋﾞｼﾄｳｷﾖｳUFJ  ",{"$f":"IF($R6=\"\",\"\",INDEX(社員データ!$A$2:$I$11,MATCH($R6,社員データ!$A$2:$A$11,0),6))","v":"150"},{"$f":"IF($R6=\"\",\"\",INDEX(社員データ!$A$2:$I$11,MATCH($R6,社員データ!$A$2:$A$11,0),7))","v":"ﾅｺﾞﾔ           "},"    ",{"$f":"IF($R6=\"\",\"\",INDEX(社員データ!$A$2:$I$11,MATCH($R6,社員データ!$A$2:$A$11,0),8))","v":1},{"$f":"IF($R6=\"\",\"\",TEXT(INDEX(社員データ!$A$2:$I$11,MATCH($R6,社員データ!$A$2:$A$11,0),9),\"0000000\"))","v":"0333333"},{"$f":"IF($R6=\"\",\"\",INDEX(社員データ!$A$2:$I$11,MATCH($R6,社員データ!$A$2:$A$11,0),3))","v":"ﾄｳｷﾖｳﾀﾛｳ                      "},{"$f":"IF(支払データ!$D7=\"\",\"\",TEXT(支払データ!$D7,\"0000000000\"))","v":"0000003333"},0,{"$f":"IF(支払データ!$B7=\"\",\"\",TEXT(支払データ!$B7,\"0000000000\"))","v":"0033333333"},{"$f":"IF(支払データ!$C$2=\"\",\"\",TEXT(支払データ!$C$2,\"0000000000\"))","v":"0000001111"},7,"X","       ",null,{"$f":"IF(支払データ!$B7=\"\",\"\",支払データ!$B7)","v":33333333}]
[2,"0005","ﾐﾂﾋﾞｼﾄｳｷﾖｳUFJ  ",{"$f":"IF($R7=\"\",\"\",INDEX(社員データ!$A$2:$I$11,MATCH($R7,社員データ!$A$2:$A$11,0),6))","v":"333"},{"$f":"IF($R7=\"\",\"\",INDEX(社員データ!$A$2:$I$11,MATCH($R7,社員データ!$A$2:$A$11,0),7))","v":"ﾆﾎﾝﾊﾞｼﾁﾕｳｵｳ    "},"    ",{"$f":"IF($R7=\"\",\"\",INDEX(社員データ!$A$2:$I$11,MATCH($R7,社員データ!$A$2:$A$11,0),8))","v":1},{"$f":"IF($R7=\"\",\"\",TEXT(INDEX(社員データ!$A$2:$I$11,MATCH($R7,社員データ!$A$2:$A$11,0),9),\"0000000\"))","v":"0444444"},{"$f":"IF($R7=\"\",\"\",INDEX(社員データ!$A$2:$I$11,MATCH($R7,社員データ!$A$2:$A$11,0),3))","v":"ﾆﾂﾎﾟﾝﾀﾛｳ                      "},{"$f":"IF(支払データ!$D8=\"\",\"\",TEXT(支払データ!$D8,\"0000000000\"))","v":"0000004444"},0,{"$f":"IF(支払データ!$B8=\"\",\"\",TEXT(支払データ!$B8,\"0000000000\"))","v":"0044444444"},{"$f":"IF(支払データ!$C$2=\"\",\"\",TEXT(支払データ!$C$2,\"0000000000\"))","v":"0000001111"},7,"X","       ",null,{"$f":"IF(支払データ!$B8=\"\",\"\",支払データ!$B8)","v":44444444}]
[2,"0005","ﾐﾂﾋﾞｼﾄｳｷﾖｳUFJ  ",{"$f":"IF($R8=\"\",\"\",INDEX(社員データ!$A$2:$I$11,MATCH($R8,社員データ!$A$2:$A$11,0),6))","v":"213"},{"$f":"IF($R8=\"\",\"\",INDEX(社員データ!$A$2:$I$11,MATCH($R8,社員データ!$A$2:$A$11,0),7))","v":"ｶｽｶﾞｲ          "},"    ",{"$f":"IF($R8=\"\",\"\",INDEX(社員データ!$A$2:$I$11,MATCH($R8,社員データ!$A$2:$A$11,0),8))","v":1},{"$f":"IF($R8=\"\",\"\",TEXT(INDEX(社員データ!$A$2:$I$11,MATCH($R8,社員データ!$A$2:$A$11,0),9),\"0000000\"))","v":"0555555"},{"$f":"IF($R8=\"\",\"\",INDEX(社員データ!$A$2:$I$11,MATCH($R8,社員データ!$A$2:$A$11,0),3))","v":"ｵｵｻｶﾀﾛｳ                       "},{"$f":"IF(支払データ!$D9=\"\",\"\",TEXT(支払データ!$D9,\"0000000000\"))","v":"0000005555"},0,{"$f":"IF(支払データ!$B9=\"\",\"\",TEXT(支払データ!$B9,\"0000000000\"))","v":"0055555555"},{"$f":"IF(支払データ!$C$2=\"\",\"\",TEXT(支払データ!$C$2,\"0000000000\"))","v":"0000001111"},7,"X","       ",null,{"$f":"IF(支払データ!$B9=\"\",\"\",支払データ!$B9)","v":55555555}]
[2,"0005","ﾐﾂﾋﾞｼﾄｳｷﾖｳUFJ  ",{"$f":"IF($R9=\"\",\"\",INDEX(社員データ!$A$2:$I$11,MATCH($R9,社員データ!$A$2:$A$11,0),6))","v":"498"},{"$f":"IF($R9=\"\",\"\",INDEX(社員データ!$A$2:$I$11,MATCH($R9,社員データ!$A$2:$A$11,0),7))","v":"ｳﾍﾞ            "},"    ",{"$f":"IF($R9=\"\",\"\",INDEX(社員データ!$A$2:$I$11,MATCH($R9,社員データ!$A$2:$A$11,0),8))","v":1},{"$f":"IF($R9=\"\",\"\",TEXT(INDEX(社員データ!$A$2:$I$11,MATCH($R9,社員データ!$A$2:$A$11,0),9),\"0000000\"))","v":"0666666"},{"$f":"IF($R9=\"\",\"\",INDEX(社員データ!$A$2:$I$11,MATCH($R9,社員データ!$A$2:$A$11,0),3))","v":"ﾅｺﾞﾔﾀﾛｳ                       "},{"$f":"IF(支払データ!$D10=\"\",\"\",TEXT(支払データ!$D10,\"0000000000\"))","v":"0000006666"},0,{"$f":"IF(支払データ!$B10=\"\",\"\",TEXT(支払データ!$B10,\"0000000000\"))","v":"0066666666"},{"$f":"IF(支払データ!$C$2=\"\",\"\",TEXT(支払データ!$C$2,\"0000000000\"))","v":"0000001111"},7,"X","       ",null,{"$f":"IF(支払データ!$B10=\"\",\"\",支払データ!$B10)","v":66666666}]
[2,"0005","ﾐﾂﾋﾞｼﾄｳｷﾖｳUFJ  ",{"$f":"IF($R10=\"\",\"\",INDEX(社員データ!$A$2:$I$11,MATCH($R10,社員データ!$A$2:$A$11,0),6))","v":"895"},{"$f":"IF($R10=\"\",\"\",INDEX(社員データ!$A$2:$I$11,MATCH($R10,社員データ!$A$2:$A$11,0),7))","v":"ｲﾀﾊﾞｼ          "},"    ",{"$f":"IF($R10=\"\",\"\",INDEX(社員データ!$A$2:$I$11,MATCH($R10,社員データ!$A$2:$A$11,0),8))","v":1},{"$f":"IF($R10=\"\",\"\",TEXT(INDEX(社員データ!$A$2:$I$11,MATCH($R10,社員データ!$A$2:$A$11,0),9),\"0000000\"))","v":"0777777"},{"$f":"IF($R10=\"\",\"\",INDEX(社員データ!$A$2:$I$11,MATCH($R10,社員データ!$A$2:$A$11,0),3))","v":"ｻﾂﾎﾟﾛﾀﾛｳ                      "},{"$f":"IF(支払データ!$D11=\"\",\"\",TEXT(支払データ!$D11,\"0000000000\"))","v":"0000007777"},0,{"$f":"IF(支払データ!$B11=\"\",\"\",TEXT(支払データ!$B11,\"0000000000\"))","v":"0077777777"},{"$f":"IF(支払データ!$C$2=\"\",\"\",TEXT(支払データ!$C$2,\"0000000000\"))","v":"0000001111"},7,"X","       ",null,{"$f":"IF(支払データ!$B11=\"\",\"\",支払データ!$B11)","v":77777777}]
[2,"0005","ﾐﾂﾋﾞｼﾄｳｷﾖｳUFJ  ",{"$f":"IF($R11=\"\",\"\",INDEX(社員データ!$A$2:$I$11,MATCH($R11,社員データ!$A$2:$A$11,0),6))","v":"777"},{"$f":"IF($R11=\"\",\"\",INDEX(社員データ!$A$2:$I$11,MATCH($R11,社員データ!$A$2:$A$11,0),7))","v":"ｸｽﾉｷ           "},"    ",{"$f":"IF($R11=\"\",\"\",INDEX(社員データ!$A$2:$I$11,MATCH($R11,社員データ!$A$2:$A$11,0),8))","v":1},{"$f":"IF($R11=\"\",\"\",TEXT(INDEX(社員データ!$A$2:$I$11,MATCH($R11,社員データ!$A$2:$A$11,0),9),\"0000000\"))","v":"0888888"},{"$f":"IF($R11=\"\",\"\",INDEX(社員データ!$A$2:$I$11,MATCH($R11,社員データ!$A$2:$A$11,0),3))","v":"ﾌｸｵｶﾀﾛｳ                       "},{"$f":"IF(支払データ!$D12=\"\",\"\",TEXT(支払データ!$D12,\"0000000000\"))","v":"0000008888"},0,{"$f":"IF(支払データ!$B12=\"\",\"\",TEXT(支払データ!$B12,\"0000000000\"))","v":"0088888888"},{"$f":"IF(支払データ!$C$2=\"\",\"\",TEXT(支払データ!$C$2,\"0000000000\"))","v":"0000001111"},7,"X","       ",null,{"$f":"IF(支払データ!$B12=\"\",\"\",支払データ!$B12)","v":88888888}]
[2,"0005","ﾐﾂﾋﾞｼﾄｳｷﾖｳUFJ  ",{"$f":"IF($R12=\"\",\"\",INDEX(社員データ!$A$2:$I$11,MATCH($R12,社員データ!$A$2:$A$11,0),6))","v":"626"},{"$f":"IF($R12=\"\",\"\",INDEX(社員データ!$A$2:$I$11,MATCH($R12,社員データ!$A$2:$A$11,0),7))","v":"ｱｷﾊﾊﾞﾗ         "},"    ",{"$f":"IF($R12=\"\",\"\",INDEX(社員データ!$A$2:$I$11,MATCH($R12,社員データ!$A$2:$A$11,0),8))","v":1},{"$f":"IF($R12=\"\",\"\",TEXT(INDEX(社員データ!$A$2:$I$11,MATCH($R12,社員データ!$A$2:$A$11,0),9),\"0000000\"))","v":"0999999"},{"$f":"IF($R12=\"\",\"\",INDEX(社員データ!$A$2:$I$11,MATCH($R12,社員データ!$A$2:$A$11,0),3))","v":"ｷﾖｳﾄﾀﾛｳ                       "},{"$f":"IF(支払データ!$D13=\"\",\"\",TEXT(支払データ!$D13,\"0000000000\"))","v":"0000009999"},0,{"$f":"IF(支払データ!$B13=\"\",\"\",TEXT(支払データ!$B13,\"0000000000\"))","v":"0099999999"},{"$f":"IF(支払データ!$C$2=\"\",\"\",TEXT(支払データ!$C$2,\"0000000000\"))","v":"0000001111"},7,"X","       ",null,{"$f":"IF(支払データ!$B13=\"\",\"\",支払データ!$B13)","v":99999999}]
[2,"0005","ﾐﾂﾋﾞｼﾄｳｷﾖｳUFJ  ",{"$f":"IF($R13=\"\",\"\",INDEX(社員データ!$A$2:$I$11,MATCH($R13,社員データ!$A$2:$A$11,0),6))","v":"713"},{"$f":"IF($R13=\"\",\"\",INDEX(社員データ!$A$2:$I$11,MATCH($R13,社員データ!$A$2:$A$11,0),7))","v":"ｼﾂﾞ            "},"    ",{"$f":"IF($R13=\"\",\"\",INDEX(社員データ!$A$2:$I$11,MATCH($R13,社員データ!$A$2:$A$11,0),8))","v":1},{"$f":"IF($R13=\"\",\"\",TEXT(INDEX(社員データ!$A$2:$I$11,MATCH($R13,社員データ!$A$2:$A$11,0),9),\"0000000\"))","v":"1234567"},{"$f":"IF($R13=\"\",\"\",INDEX(社員データ!$A$2:$I$11,MATCH($R13,社員データ!$A$2:$A$11,0),3))","v":"ﾖｺﾊﾏﾀﾛｳ                       "},{"$f":"IF(支払データ!$D14=\"\",\"\",TEXT(支払データ!$D14,\"0000000000\"))","v":"0000001000"},0,{"$f":"IF(支払データ!$B14=\"\",\"\",TEXT(支払データ!$B14,\"0000000000\"))","v":"0012345678"},{"$f":"IF(支払データ!$C$2=\"\",\"\",TEXT(支払データ!$C$2,\"0000000000\"))","v":"0000001111"},7,"X","       ",null,{"$f":"IF(支払データ!$B14=\"\",\"\",支払データ!$B14)","v":12345678}]
[2,"0005","ﾐﾂﾋﾞｼﾄｳｷﾖｳUFJ  ",{"$f":"IF($R14=\"\",\"\",INDEX(社員データ!$A$2:$I$11,MATCH($R14,社員データ!$A$2:$A$11,0),6))","v":"001"},{"$f":"IF($R14=\"\",\"\",INDEX(社員データ!$A$2:$I$11,MATCH($R14,社員データ!$A$2:$A$11,0),7))","v":"ﾎﾝﾃﾝ           "},"    ",{"$f":"IF($R14=\"\",\"\",INDEX(社員データ!$A$2:$I$11,MATCH($R14,社員データ!$A$2:$A$11,0),8))","v":1},{"$f":"IF($R14=\"\",\"\",TEXT(INDEX(社員データ!$A$2:$I$11,MATCH($R14,社員データ!$A$2:$A$11,0),9),\"0000000\"))","v":"0111111"},{"$f":"IF($R14=\"\",\"\",INDEX(社員データ!$A$2:$I$11,MATCH($R14,社員データ!$A$2:$A$11,0),3))","v":"ﾐﾂﾋﾞｼﾀﾛｳ                      "},{"$f":"IF(支払データ!$D15=\"\",\"\",TEXT(支払データ!$D15,\"0000000000\"))","v":"0000001111"},0,{"$f":"IF(支払データ!$B15=\"\",\"\",TEXT(支払データ!$B15,\"0000000000\"))","v":"0011111111"},{"$f":"IF(支払データ!$C$2=\"\",\"\",TEXT(支払データ!$C$2,\"0000000000\"))","v":"0000001111"},7,"X","       ",null,{"$f":"IF(支払データ!$B15=\"\",\"\",支払データ!$B15)","v":11111111}]
[2,"0005","ﾐﾂﾋﾞｼﾄｳｷﾖｳUFJ  ",{"$f":"IF($R15=\"\",\"\",INDEX(社員データ!$A$2:$I$11,MATCH($R15,社員データ!$A$2:$A$11,0),6))","v":"005"},{"$f":"IF($R15=\"\",\"\",INDEX(社員データ!$A$2:$I$11,MATCH($R15,社員データ!$A$2:$A$11,0),7))","v":"ｵｵｻｶ           "},"    ",{"$f":"IF($R15=\"\",\"\",INDEX(社員データ!$A$2:$I$11,MATCH($R15,社員データ!$A$2:$A$11,0),8))","v":1},{"$f":"IF($R15=\"\",\"\",TEXT(INDEX(社員データ!$A$2:$I$11,MATCH($R15,社員データ!$A$2:$A$11,0),9),\"0000000\"))","v":"0222222"},{"$f":"IF($R15=\"\",\"\",INDEX(社員データ!$A$2:$I$11,MATCH($R15,社員データ!$A$2:$A$11,0),3))","v":"UFJﾀﾛｳ                        "},{"$f":"IF(支払データ!$D16=\"\",\"\",TEXT(支払データ!$D16,\"0000000000\"))","v":"0000002222"},0,{"$f":"IF(支払データ!$B16=\"\",\"\",TEXT(支払データ!$B16,\"0000000000\"))","v":"0022222222"},{"$f":"IF(支払データ!$C$2=\"\",\"\",TEXT(支払データ!$C$2,\"0000000000\"))","v":"0000001111"},7,"X","       ",null,{"$f":"IF(支払データ!$B16=\"\",\"\",支払データ!$B16)","v":22222222}]
[2,"0005","ﾐﾂﾋﾞｼﾄｳｷﾖｳUFJ  ",{"$f":"IF($R16=\"\",\"\",INDEX(社員データ!$A$2:$I$11,MATCH($R16,社員データ!$A$2:$A$11,0),6))","v":"150"},{"$f":"IF($R16=\"\",\"\",INDEX(社員データ!$A$2:$I$11,MATCH($R16,社員データ!$A$2:$A$11,0),7))","v":"ﾅｺﾞﾔ           "},"    ",{"$f":"IF($R16=\"\",\"\",INDEX(社員データ!$A$2:$I$11,MATCH($R16,社員データ!$A$2:$A$11,0),8))","v":1},{"$f":"IF($R16=\"\",\"\",TEXT(INDEX(社員データ!$A$2:$I$11,MATCH($R16,社員データ!$A$2:$A$11,0),9),\"0000000\"))","v":"0333333"},{"$f":"IF($R16=\"\",\"\",INDEX(社員データ!$A$2:$I$11,MATCH($R16,社員データ!$A$2:$A$11,0),3))","v":"ﾄｳｷﾖｳﾀﾛｳ                      "},{"$f":"IF(支払データ!$D17=\"\",\"\",TEXT(支払データ!$D17,\"0000000000\"))","v":"0000003333"},0,{"$f":"IF(支払データ!$B17=\"\",\"\",TEXT(支払データ!$B17,\"0000000000\"))","v":"0033333333"},{"$f":"IF(支払データ!$C$2=\"\",\"\",TEXT(支払データ!$C$2,\"0000000000\"))","v":"0000001111"},7,"X","       ",null,{"$f":"IF(支払データ!$B17=\"\",\"\",支払データ!$B17)","v":33333333}]
[2,"0005","ﾐﾂﾋﾞｼﾄｳｷﾖｳUFJ  ",{"$f":"IF($R17=\"\",\"\",INDEX(社員データ!$A$2:$I$11,MATCH($R17,社員データ!$A$2:$A$11,0),6))","v":"333"},{"$f":"IF($R17=\"\",\"\",INDEX(社員データ!$A$2:$I$11,MATCH($R17,社員データ!$A$2:$A$11,0),7))","v":"ﾆﾎﾝﾊﾞｼﾁﾕｳｵｳ    "},"    ",{"$f":"IF($R17=\"\",\"\",INDEX(社員データ!$A$2:$I$11,MATCH($R17,社員データ!$A$2:$A$11,0),8))","v":1},{"$f":"IF($R17=\"\",\"\",TEXT(INDEX(社員データ!$A$2:$I$11,MATCH($R17,社員データ!$A$2:$A$11,0),9),\"0000000\"))","v":"0444444"},{"$f":"IF($R17=\"\",\"\",INDEX(社員データ!$A$2:$I$11,MATCH($R17,社員データ!$A$2:$A$11,0),3))","v":"ﾆﾂﾎﾟﾝﾀﾛｳ                      "},{"$f":"IF(支払データ!$D18=\"\",\"\",TEXT(支払データ!$D18,\"0000000000\"))","v":"0000004444"},0,{"$f":"IF(支払データ!$B18=\"\",\"\",TEXT(支払データ!$B18,\"0000000000\"))","v":"0044444444"},{"$f":"IF(支払データ!$C$2=\"\",\"\",TEXT(支払データ!$C$2,\"0000000000\"))","v":"0000001111"},7,"X","       ",null,{"$f":"IF(支払データ!$B18=\"\",\"\",支払データ!$B18)","v":44444444}]
[2,"0005","ﾐﾂﾋﾞｼﾄｳｷﾖｳUFJ  ",{"$f":"IF($R18=\"\",\"\",INDEX(社員データ!$A$2:$I$11,MATCH($R18,社員データ!$A$2:$A$11,0),6))","v":"213"},{"$f":"IF($R18=\"\",\"\",INDEX(社員データ!$A$2:$I$11,MATCH($R18,社員データ!$A$2:$A$11,0),7))","v":"ｶｽｶﾞｲ          "},"    ",{"$f":"IF($R18=\"\",\"\",INDEX(社員データ!$A$2:$I$11,MATCH($R18,社員データ!$A$2:$A$11,0),8))","v":1},{"$f":"IF($R18=\"\",\"\",TEXT(INDEX(社員データ!$A$2:$I$11,MATCH($R18,社員データ!$A$2:$A$11,0),9),\"0000000\"))","v":"0555555"},{"$f":"IF($R18=\"\",\"\",INDEX(社員データ!$A$2:$I$11,MATCH($R18,社員データ!$A$2:$A$11,0),3))","v":"ｵｵｻｶﾀﾛｳ                       "},{"$f":"IF(支払データ!$D19=\"\",\"\",TEXT(支払データ!$D19,\"0000000000\"))","v":"0000005555"},0,{"$f":"IF(支払データ!$B19=\"\",\"\",TEXT(支払データ!$B19,\"0000000000\"))","v":"0055555555"},{"$f":"IF(支払データ!$C$2=\"\",\"\",TEXT(支払データ!$C$2,\"0000000000\"))","v":"0000001111"},7,"X","       ",null,{"$f":"IF(支払データ!$B19=\"\",\"\",支払データ!$B19)","v":55555555}]
[2,"0005","ﾐﾂﾋﾞｼﾄｳｷﾖｳUFJ  ",{"$f":"IF($R19=\"\",\"\",INDEX(社員データ!$A$2:$I$11,MATCH($R19,社員データ!$A$2:$A$11,0),6))","v":"498"},{"$f":"IF($R19=\"\",\"\",INDEX(社員データ!$A$2:$I$11,MATCH($R19,社員データ!$A$2:$A$11,0),7))","v":"ｳﾍﾞ            "},"    ",{"$f":"IF($R19=\"\",\"\",INDEX(社員データ!$A$2:$I$11,MATCH($R19,社員データ!$A$2:$A$11,0),8))","v":1},{"$f":"IF($R19=\"\",\"\",TEXT(INDEX(社員データ!$A$2:$I$11,MATCH($R19,社員データ!$A$2:$A$11,0),9),\"0000000\"))","v":"0666666"},{"$f":"IF($R19=\"\",\"\",INDEX(社員データ!$A$2:$I$11,MATCH($R19,社員データ!$A$2:$A$11,0),3))","v":"ﾅｺﾞﾔﾀﾛｳ                       "},{"$f":"IF(支払データ!$D20=\"\",\"\",TEXT(支払データ!$D20,\"0000000000\"))","v":"0000006666"},0,{"$f":"IF(支払データ!$B20=\"\",\"\",TEXT(支払データ!$B20,\"0000000000\"))","v":"0066666666"},{"$f":"IF(支払データ!$C$2=\"\",\"\",TEXT(支払データ!$C$2,\"0000000000\"))","v":"0000001111"},7,"X","       ",null,{"$f":"IF(支払データ!$B20=\"\",\"\",支払データ!$B20)","v":66666666}]
[2,"0005","ﾐﾂﾋﾞｼﾄｳｷﾖｳUFJ  ",{"$f":"IF($R20=\"\",\"\",INDEX(社員データ!$A$2:$I$11,MATCH($R20,社員データ!$A$2:$A$11,0),6))","v":"895"},{"$f":"IF($R20=\"\",\"\",INDEX(社員データ!$A$2:$I$11,MATCH($R20,社員データ!$A$2:$A$11,0),7))","v":"ｲﾀﾊﾞｼ          "},"    ",{"$f":"IF($R20=\"\",\"\",INDEX(社員データ!$A$2:$I$11,MATCH($R20,社員データ!$A$2:$A$11,0),8))","v":1},{"$f":"IF($R20=\"\",\"\",TEXT(INDEX(社員データ!$A$2:$I$11,MATCH($R20,社員データ!$A$2:$A$11,0),9),\"0000000\"))","v":"0777777"},{"$f":"IF($R20=\"\",\"\",INDEX(社員データ!$A$2:$I$11,MATCH($R20,社員データ!$A$2:$A$11,0),3))","v":"ｻﾂﾎﾟﾛﾀﾛｳ                      "},{"$f":"IF(支払データ!$D21=\"\",\"\",TEXT(支払データ!$D21,\"0000000000\"))","v":"0000007777"},0,{"$f":"IF(支払データ!$B21=\"\",\"\",TEXT(支払データ!$B21,\"0000000000\"))","v":"0077777777"},{"$f":"IF(支払データ!$C$2=\"\",\"\",TEXT(支払データ!$C$2,\"0000000000\"))","v":"0000001111"},7,"X","       ",null,{"$f":"IF(支払データ!$B21=\"\",\"\",支払データ!$B21)","v":77777777}]
[2,"0005","ﾐﾂﾋﾞｼﾄｳｷﾖｳUFJ  ",{"$f":"IF($R21=\"\",\"\",INDEX(社員データ!$A$2:$I$11,MATCH($R21,社員データ!$A$2:$A$11,0),6))","v":"777"},{"$f":"IF($R21=\"\",\"\",INDEX(社員データ!$A$2:$I$11,MATCH($R21,社員データ!$A$2:$A$11,0),7))","v":"ｸｽﾉｷ           "},"    ",{"$f":"IF($R21=\"\",\"\",INDEX(社員データ!$A$2:$I$11,MATCH($R21,社員データ!$A$2:$A$11,0),8))","v":1},{"$f":"IF($R21=\"\",\"\",TEXT(INDEX(社員データ!$A$2:$I$11,MATCH($R21,社員データ!$A$2:$A$11,0),9),\"0000000\"))","v":"0888888"},{"$f":"IF($R21=\"\",\"\",INDEX(社員データ!$A$2:$I$11,MATCH($R21,社員データ!$A$2:$A$11,0),3))","v":"ﾌｸｵｶﾀﾛｳ                       "},{"$f":"IF(支払データ!$D22=\"\",\"\",TEXT(支払データ!$D22,\"0000000000\"))","v":"0000008888"},0,{"$f":"IF(支払データ!$B22=\"\",\"\",TEXT(支払データ!$B22,\"0000000000\"))","v":"0088888888"},{"$f":"IF(支払データ!$C$2=\"\",\"\",TEXT(支払データ!$C$2,\"0000000000\"))","v":"0000001111"},7,"X","       ",null,{"$f":"IF(支払データ!$B22=\"\",\"\",支払データ!$B22)","v":88888888}]
[2,"0005","ﾐﾂﾋﾞｼﾄｳｷﾖｳUFJ  ",{"$f":"IF($R22=\"\",\"\",INDEX(社員データ!$A$2:$I$11,MATCH($R22,社員データ!$A$2:$A$11,0),6))","v":"626"},{"$f":"IF($R22=\"\",\"\",INDEX(社員データ!$A$2:$I$11,MATCH($R22,社員データ!$A$2:$A$11,0),7))","v":"ｱｷﾊﾊﾞﾗ         "},"    ",{"$f":"IF($R22=\"\",\"\",INDEX(社員データ!$A$2:$I$11,MATCH($R22,社員データ!$A$2:$A$11,0),8))","v":1},{"$f":"IF($R22=\"\",\"\",TEXT(INDEX(社員データ!$A$2:$I$11,MATCH($R22,社員データ!$A$2:$A$11,0),9),\"0000000\"))","v":"0999999"},{"$f":"IF($R22=\"\",\"\",INDEX(社員データ!$A$2:$I$11,MATCH($R22,社員データ!$A$2:$A$11,0),3))","v":"ｷﾖｳﾄﾀﾛｳ                       "},{"$f":"IF(支払データ!$D23=\"\",\"\",TEXT(支払データ!$D23,\"0000000000\"))","v":"0000009999"},0,{"$f":"IF(支払データ!$B23=\"\",\"\",TEXT(支払データ!$B23,\"0000000000\"))","v":"0099999999"},{"$f":"IF(支払データ!$C$2=\"\",\"\",TEXT(支払データ!$C$2,\"0000000000\"))","v":"0000001111"},7,"X","       ",null,{"$f":"IF(支払データ!$B23=\"\",\"\",支払データ!$B23)","v":99999999}]
[2,"0005","ﾐﾂﾋﾞｼﾄｳｷﾖｳUFJ  ",{"$f":"IF($R23=\"\",\"\",INDEX(社員データ!$A$2:$I$11,MATCH($R23,社員データ!$A$2:$A$11,0),6))","v":"713"},{"$f":"IF($R23=\"\",\"\",INDEX(社員データ!$A$2:$I$11,MATCH($R23,社員データ!$A$2:$A$11,0),7))","v":"ｼﾂﾞ            "},"    ",{"$f":"IF($R23=\"\",\"\",INDEX(社員データ!$A$2:$I$11,MATCH($R23,社員データ!$A$2:$A$11,0),8))","v":1},{"$f":"IF($R23=\"\",\"\",TEXT(INDEX(社員データ!$A$2:$I$11,MATCH($R23,社員データ!$A$2:$A$11,0),9),\"0000000\"))","v":"1234567"},{"$f":"IF($R23=\"\",\"\",INDEX(社員データ!$A$2:$I$11,MATCH($R23,社員データ!$A$2:$A$11,0),3))","v":"ﾖｺﾊﾏﾀﾛｳ                       "},{"$f":"IF(支払データ!$D24=\"\",\"\",TEXT(支払データ!$D24,\"0000000000\"))","v":"0000001000"},0,{"$f":"IF(支払データ!$B24=\"\",\"\",TEXT(支払データ!$B24,\"0000000000\"))","v":"0012345678"},{"$f":"IF(支払データ!$C$2=\"\",\"\",TEXT(支払データ!$C$2,\"0000000000\"))","v":"0000001111"},7,"X","       ",null,{"$f":"IF(支払データ!$B24=\"\",\"\",支払データ!$B24)","v":12345678}]

{"sheet":"全銀形式（ソート)","index":6,"n_rows":0,"n_cols":0,"rows_kept":0,"cut":false,"hidden":false,"merged":[]}