{"text_format":"1","workbook":"xlsx","n_sheets":7,"sheets":["総合振込（全銀形式）レコードフォーマット","支店コード ","社員データ","部門コード","支払データ","全銀形式（データ)","全銀形式（ソート)"],"not_rendered":{"charts":0,"images":0,"macros":1,"external_links":0,"defined_names":2,"comments":0,"pivot_tables":0},"unopened":[],"bounds":{"document_bytes":16777216,"sheet_cells":100000,"rows_first":2000,"rows_last":500,"rows_between":2000,"halvings":0,"cell_chars":16384,"cell_head_chars":4096},"cells_cut":0,"cells_raw":0,"read":"whole","date_system":"1904"}

{"sheet":"総合振込（全銀形式）レコードフォーマット","index":0,"n_rows":54,"n_cols":4,"rows_kept":54,"cut":false,"hidden":false,"merged":[]}
["①ヘッダレコード"]
["項番","項目名","属性","項目内容"]
[1,"データ区分","N(1)","「1」ヘッダレコードをセット"]
["2","種別コード","N(2)","「21」総合振込"]
["3","コード区分","N(1)","使用文字コードの区分（0：JIS　1：EBCDIC）\n・BizSTATIONでは取り込みません（スペースで可）"]
["4","振込依頼人コード","N(10)","お客さまの契約者番号（スペースで可）\n企業コードをご利用の場合は、企業コードをセット"]
["5","振込依頼人名","C(40)","振込依頼人名を左詰めでセット（残りはスペース）＊１"]
["6","取組日","N(4)","振込指定日（MMDD）をセット　（例）0903"]
["7","仕向銀行番号","N(4)","「0005」をセット"]
["8","仕向銀行名","C(15)","「ﾐﾂﾋﾞｼﾄｳｷﾖｳUFJ」を左詰めでセット（残りはスペース）＊１"]
["9","仕向支店番号","N(3)","統一店番号を右詰めでセット（前は\"0\"で埋めます）"]
["10","仕向支店名","C(15)","仕向支店名を左詰めでセット（残りはスペース）＊１"]
["11","預金種目（依頼人）","N(1)","預金種目\n1：普通預金　2：当座預金"]
["12","口座番号（依頼人）","N(7)","口座番号を右詰めでセット（前は\"0\"で埋めます）"]
["13","ダミー","C(17)","スペースをセット"]
[]
["②データレコード"]
["項番","項目名","属性","項目内容"]
["1","データ区分","N(1)","「2」データレコードをセット"]
["2","被仕向銀行番号","N(4)","統一金融機関番号を右詰めでセット（前は\"0\"で埋めます）"]
{"$rows_left_out":35}
{"sheet":"支店コード ","index":1,"n_rows":723,"n_cols":4,"rows_kept":723,"cut":false,"hidden":false,"merged":[]}
["店番","支店名","支店名（ｶﾅ）","支店名（ｶﾅ）\n文字数"]
["001","本店","ﾎﾝﾃﾝ           ",{"$f":"LEN(C2)","v":15}]
["002","丸の内","ﾏﾙﾉｳﾁ          ",{"$f":"LEN(C3)","v":15}]
["003","瓦町","ｶﾜﾗﾏﾁ          ",15]
["004","船場","ｾﾝﾊﾞ           ",15]
["005","大阪営業部","ｵｵｻｶ           ",15]
["006","歌島橋","ｳﾀｼﾞﾏﾊﾞｼ       ",15]
["007","玉造","ﾀﾏﾂｸﾘ          ",15]
["010","神田駅前","ｶﾝﾀﾞｴｷﾏｴ       ",15]
["011","大東","ﾀﾞｲﾄｳ          ",15]
["012","伊勢","ｲｾ             ",15]
["013","神保町","ｼﾞﾝﾎﾞｳﾁﾖｳ      ",15]
["014","市ヶ谷","ｲﾁｶﾞﾔ          ",15]
["015","麹町中央","ｺｳｼﾞﾏﾁﾁﾕｳｵｳ    ",15]
["016","鶴橋","ﾂﾙﾊｼ           ",15]
["017","生野","ｲｸﾉ            ",15]
["018","鴻池新田","ｺｳﾉｲｹｼﾝﾃﾞﾝ     ",15]
["019","谷町","ﾀﾆﾏﾁ           ",15]
["020","日本橋","ﾆﾎﾝﾊﾞｼ         ",15]
["021","寺田町","ﾃﾗﾀﾞﾁﾖｳ        ",15]
{"$rows_left_out":704}
{"sheet":"社員データ","index":2,"n_rows":11,"n_cols":10,"rows_kept":11,"cut":false,"hidden":false,"merged":[]}
["社員番号\n(C10)","社員氏名","社員氏名\n(ｶﾅ)(C30)","銀行\nｺｰﾄﾞ","銀行名(ｶﾅ)\n(C15)","支店\n番号","支店名(ｶﾅ)","預金\n種目","口座番号\n(N7)","社員名(ｶﾅ)\n文字数"]
[11111111,"三菱太郎","ﾐﾂﾋﾞｼﾀﾛｳ                      ","005","ﾐﾂﾋﾞｼﾄｳｷﾖｳUFJ  ","001",{"$f":"VLOOKUP(F2,'支店コード '!$A$2:$C$723,3,FALSE)","v":"ﾎﾝﾃﾝ           "},1,111111,{"$f":"LEN(C2)","v":30}]
[22222222,"UFJ太郎","UFJﾀﾛｳ                        ","005","ﾐﾂﾋﾞｼﾄｳｷﾖｳUFJ  ","005",{"$f":"VLOOKUP(F3,'支店コード '!$A$2:$C$723,3,FALSE)","v":"ｵｵｻｶ           "},1,222222,30]
[33333333,"東京太郎","ﾄｳｷﾖｳﾀﾛｳ                      ","005","ﾐﾂﾋﾞｼﾄｳｷﾖｳUFJ  ","150",{"$f":"VLOOKUP(F4,'支店コード '!$A$2:$C$723,3,FALSE)","v":"ﾅｺﾞﾔ           "},1,333333,30]
[44444444,"日本太郎","ﾆﾂﾎﾟﾝﾀﾛｳ                      ","005","ﾐﾂﾋﾞｼﾄｳｷﾖｳUFJ  ","333",{"$f":"VLOOKUP(F5,'支店コード '!$A$2:$C$723,3,FALSE)","v":"ﾆﾎﾝﾊﾞｼﾁﾕｳｵｳ    "},1,444444,30]
[55555555,"大阪太郎","ｵｵｻｶﾀﾛｳ                       ","005","ﾐﾂﾋﾞｼﾄｳｷﾖｳUFJ  ","213",{"$f":"VLOOKUP(F6,'支店コード '!$A$2:$C$723,3,FALSE)","v":"ｶｽｶﾞｲ          "},1,555555,30]
[66666666,"名古屋太郎","ﾅｺﾞﾔﾀﾛｳ                       ","005","ﾐﾂﾋﾞｼﾄｳｷﾖｳUFJ  ","498",{"$f":"VLOOKUP(F7,'支店コード '!$A$2:$C$723,3,FALSE)","v":"ｳﾍﾞ            "},1,666666,30]
[77777777,"札幌太郎","ｻﾂﾎﾟﾛﾀﾛｳ                      ","005","ﾐﾂﾋﾞｼﾄｳｷﾖｳUFJ  ","895",{"$f":"VLOOKUP(F8,'支店コード '!$A$2:$C$723,3,FALSE)","v":"ｲﾀﾊﾞｼ          "},1,777777,30]
[88888888,"福岡太郎","ﾌｸｵｶﾀﾛｳ                       ","005","ﾐﾂﾋﾞｼﾄｳｷﾖｳUFJ  ","777",{"$f":"VLOOKUP(F9,'支店コード '!$A$2:$C$723,3,FALSE)","v":"ｸｽﾉｷ           "},1,888888,30]
[99999999,"京都太郎","ｷﾖｳﾄﾀﾛｳ                       ","005","ﾐﾂﾋﾞｼﾄｳｷﾖｳUFJ  ","626",{"$f":"VLOOKUP(F10,'支店コード '!$A$2:$C$723,3,FALSE)","v":"ｱｷﾊﾊﾞﾗ         "},1,999999,30]
[12345678,"横浜太郎","ﾖｺﾊﾏﾀﾛｳ                       ","005","ﾐﾂﾋﾞｼﾄｳｷﾖｳUFJ  ","713",{"$f":"VLOOKUP(F11,'支店コード '!$A$2:$C$723,3,FALSE)","v":"ｼﾂﾞ            "},1,1234567,30]

{"sheet":"部門コード","index":3,"n_rows":10,"n_cols":2,"rows_kept":10,"cut":false,"hidden":false,"merged":[]}
["ｺｰﾄﾞ\n(C10)","名称"]
[1111,"本社"]
[2222,"大阪支社"]
[3333,"名古屋支店"]
[4444,"営業本部"]
[5555,"管理本部"]
[6666,"経営企画部"]
[7777,"総務人事部"]
[8888,"監査部"]
[9999,"役員"]

{"sheet":"支払データ","index":4,"n_rows":27,"n_cols":4,"rows_kept":27,"cut":false,"hidden":false,"merged":[]}
["受付日","振込日","部門コード","部署名"]
["2016-10-01","2016-10-05",1111,{"$f":"VLOOKUP(C2,部門コード!$A$2:$B$10,2,FALSE)","v":"本社"}]
[]
[null,"社員番号","社員氏名","支払金額"]
[1,11111111,{"$f":"VLOOKUP(B5,社員データ!$A$2:$B$11,2,FALSE)","v":"三菱太郎"},1111]
[2,22222222,{"$f":"VLOOKUP(B6,社員データ!$A$2:$B$11,2,FALSE)","v":"UFJ太郎"},2222]
[3,33333333,{"$f":"VLOOKUP(B7,社員データ!$A$2:$B$11,2,FALSE)","v":"東京太郎"},3333]
[4,44444444,{"$f":"VLOOKUP(B8,社員データ!$A$2:$B$11,2,FALSE)","v":"日本太郎"},4444]
[5,55555555,{"$f":"VLOOKUP(B9,社員データ!$A$2:$B$11,2,FALSE)","v":"大阪太郎"},5555]
[6,66666666,{"$f":"VLOOKUP(B10,社員データ!$A$2:$B$11,2,FALSE)","v":"名古屋太郎"},6666]
[7,77777777,{"$f":"VLOOKUP(B11,社員データ!$A$2:$B$11,2,FALSE)","v":"札幌太郎"},7777]
[8,88888888,{"$f":"VLOOKUP(B12,社員データ!$A$2:$B$11,2,FALSE)","v":"福岡太郎"},8888]
[9,99999999,{"$f":"VLOOKUP(B13,社員データ!$A$2:$B$11,2,FALSE)","v":"京都太郎"},9999]
[10,12345678,{"$f":"VLOOKUP(B14,社員データ!$A$2:$B$11,2,FALSE)","v":"横浜太郎"},1000]
[11,11111111,{"$f":"VLOOKUP(B15,社員データ!$A$2:$B$11,2,FALSE)","v":"三菱太郎"},1111]
[12,22222222,{"$f":"VLOOKUP(B16,社員データ!$A$2:$B$11,2,FALSE)","v":"UFJ太郎"},2222]
[13,33333333,{"$f":"VLOOKUP(B17,社員データ!$A$2:$B$11,2,FALSE)","v":"東京太郎"},3333]
[14,44444444,{"$f":"VLOOKUP(B18,社員データ!$A$2:$B$11,2,FALSE)","v":"日本太郎"},4444]
[15,55555555,{"$f":"VLOOKUP(B19,社員データ!$A$2:$B$11,2,FALSE)","v":"大阪太郎"},5555]
[16,66666666,{"$f":"VLOOKUP(B20,社員データ!$A$2:$B$11,2,FALSE)","v":"名古屋太郎"},6666]
{"$rows_left_out":8}
{"sheet":"全銀形式（データ)","index":5,"n_rows":23,"n_cols":18,"rows_kept":23,"cut":false,"hidden":false,"merged":[]}
[1,21,0,"1234567890",{"$f":"\"ﾅｲｱｶﾞﾗ.ｴｷｽﾌﾟﾚｽ.ﾄﾚｰﾄﾞ(ｶ\"&REPT(\" \",18)","v":"ﾅｲｱｶﾞﾗ.ｴｷｽﾌﾟﾚｽ.ﾄﾚｰﾄﾞ(ｶ                  "},{"$f":"TEXT(支払データ!$B$2,\"mmdd\")","v":"1005"},"0005",{"$f":"\"ﾐﾂﾋﾞｼﾄｳｷﾖｳUFJ\"&REPT(\" \",2)","v":"ﾐﾂﾋﾞｼﾄｳｷﾖｳUFJ  "},"001",{"$f":"\"ﾎﾝﾃﾝ\"&REPT(\" \", 11)","v":"ﾎﾝﾃﾝ           "},1,1234567,{"$f":"REPT(\" \",17)","v":"                 "}]
[8,{"$f":"IF(支払データ!D26=\"\",\"\",TEXT(支払データ!D26,\"000000\"))","v":"000020"},{"$f":"IF(支払データ!D27=\"\",\"\",TEXT(支払データ!D27,\"000000000000\"))","v":"000000101990"},{"$f":"REPT(\" \",101)","v":"                                                                                                     "}]
[9,{"$f":"REPT(\" \",119)","v":"                                                                                                                       "}]
[{"$f":"IF($J4=\"\",\"\",2)","v":2},{"$f":"IF(J4=\"\",\"\",\"0005\")","v":"0005"},{"$f":"IF($J4=\"\",\"\",\"ﾐﾂﾋﾞｼﾄｳｷﾖｳUFJ\"&REPT(\" \", 2))","v":"ﾐﾂﾋﾞｼﾄｳｷﾖｳUFJ  "},{"$f":"IF($R4=\"\",\"\",INDEX(社員データ!$A$2:$I$11,MATCH($R4,社員データ!$A$2:$A$11,0),6))","v":"001"},{"$f":"IF($R4=\"\",\"\",INDEX(社員データ!$A$2:$I$11,MATCH($R4,社員データ!$A$2:$A$11,0),7))","v":"ﾎﾝﾃﾝ           "},{"$f":"REPT(\" \",4)","v":"    "},{"$f":"IF($R4=\"\",\"\",INDEX(社員データ!$A$2:$I$11,MATCH($R4,社員データ!$A$2:$A$11,0),8))","v":1},{"$f":"IF($R4=\"\",\"\",TEXT(INDEX(社員データ!$A$2:$I$11,MATCH($R4,社員データ!$A$2:$A$11,0),9),\"0000000\"))","v":"0111111"},{"$f":"IF($R4=\"\",\"\",INDEX(社員データ!$A$2:$I$11,MATCH($R4,社員データ!$A$2:$A$11,0),3))","v":"ﾐﾂﾋﾞｼﾀﾛｳ                      "},{"$f":"IF(支払データ!$D5=\"\",\"\",TEXT(支払データ!$D5,\"0000000000\"))","v":"0000001111"},{"$f":"IF(J4=\"\",\"\",0)","v":0},{"$f":"IF(支払データ!$B5=\"\",\"\",TEXT(支払データ!$B5,\"0000000000\"))","v":"0011111111"},{"$f":"IF(支払データ!$C$2=\"\",\"\",TEXT(支払データ!$C$2,\"0000000000\"))","v":"0000001111"},{"$f":"IF(J4=\"\",\"\",7)","v":7},{"$f":"IF(J4=\"\",\"\",\"X\")","v":"X"},{"$f":"REPT(\" \",7)","v":"       "},null,{"$f":"IF(支払データ!$B5=\"\",\"\",支払データ!$B5)","v":11111111}]
[{"$f":"IF($J5=\"\",\"\",2)","v":2},{"$f":"IF(J5=\"\",\"\",\"0005\")","v":"0005"},{"$f":"IF($J5=\"\",\"\",\"ﾐﾂﾋﾞｼﾄｳｷﾖｳUFJ\"&REPT(\" \", 2))","v":"ﾐﾂﾋﾞｼﾄｳｷﾖｳUFJ  "},{"$f":"IF($R5=\"\",\"\",INDEX(社員データ!$A$2:$I$11,MATCH($R5,社員データ!$A$2:$A$11,0),6))","v":"005"},{"$f":"IF($R5=\"\",\"\",INDEX(社員データ!$A$2:$I$11,MATCH($R5,社員データ!$A$2:$A$11,0),7))","v":"ｵｵｻｶ           "},{"$f":"REPT(\" \",4)","v":"    "},{"$f":"IF($R5=\"\",\"\",INDEX(社員データ!$A$2:$I$11,MATCH($R5,社員データ!$A$2:$A$11,0),8))","v":1},{"$f":"IF($R5=\"\",\"\",TEXT(INDEX(社員データ!$A$2:$I$11,MATCH($R5,社員データ!$A$2:$A$11,0),9),\"0000000\"))","v":"0222222"},{"$f":"IF($R5=\"\",\"\",INDEX(社員データ!$A$2:$I$11,MATCH($R5,社員データ!$A$2:$A$11,0),3))","v":"UFJﾀﾛｳ                        "},{"$f":"IF(支払データ!$D6=\"\",\"\",TEXT(支払データ!$D6,\"0000000000\"))","v":"0000002222"},{"$f":"IF(J5=\"\",\"\",0)","v":0},{"$f":"IF(支払データ!$B6=\"\",\"\",TEXT(支払データ!$B6,\"0000000000\"))","v":"0022222222"},{"$f":"IF(支払データ!$C$2=\"\",\"\",TEXT(支払データ!$C$2,\"0000000000\"))","v":"0000001111"},{"$f":"IF(J5=\"\",\"\",7)","v":7},{"$f":"IF(J5=\"\",\"\",\"X\")","v":"X"},{"$f":"REPT(\" \",7)","v":"       "},null,{"$f":"IF(支払データ!$B6=\"\",\"\",支払データ!$B6)","v":22222222}]
[2,"0005","ﾐﾂﾋﾞｼﾄｳｷﾖｳUFJ  ",{"$f":"IF($R6=\"\",\"\",INDEX(社員データ!$A$2:$I$11,MATCH($R6,社員データ!$A$2:$A$11,0),6))","v":"150"},{"$f":"IF($R6=\"\",\"\",INDEX(社員データ!$A$2:$I$11,MATCH($R6,社員データ!$A$2:$A$11,0),7))","v":"ﾅｺﾞﾔ           "},"    ",{"$f":"IF($R6=\"\",\"\",INDEX(社員データ!$A$2:$I$11,MATCH($R6,社員データ!$A$2:$A$11,0),8))","v":1},{"$f":"IF($R6=\"\",\"\",TEXT(INDEX(社員データ!$A$2:$I$11,MATCH($R6,社員データ!$A$2:$A$11,0),9),\"0000000\"))","v":"0333333"},{"$f":"IF($R6=\"\",\"\",INDEX(社員データ!$A$2:$I$11,MATCH($R6,社員データ!$A$2:$A$11,0),3))","v":"ﾄｳｷﾖｳﾀﾛｳ                      "},{"$f":"IF(支払データ!$D7=\"\",\"\",TEXT(支払データ!$D7,\"0000000000\"))","v":"0000003333"},0,{"$f":"IF(支払データ!$B7=\"\",\"\",TEXT(支払データ!$B7,\"0000000000\"))","v":"0033333333"},{"$f":"IF(支払データ!$C$2=\"\",\"\",TEXT(支払データ!$C$2,\"0000000000\"))","v":"0000001111"},7,"X","       ",null,{"$f":"IF(支払データ!$B7=\"\",\"\",支払データ!$B7)","v":33333333}]
[2,"0005","ﾐﾂﾋﾞｼﾄｳｷﾖｳUFJ  ",{"$f":"IF($R7=\"\",\"\",INDEX(社員データ!$A$2:$I$11,MATCH($R7,社員データ!$A$2:$A$11,0),6))","v":"333"},{"$f":"IF($R7=\"\",\"\",INDEX(社員データ!$A$2:$I$11,MATCH($R7,社員データ!$A$2:$A$11,0),7))","v":"ﾆﾎﾝﾊﾞｼﾁﾕｳｵｳ    "},"    ",{"$f":"IF($R7=\"\",\"\",INDEX(社員データ!$A$2:$I$11,MATCH($R7,社員データ!$A$2:$A$11,0),8))","v":1},{"$f":"IF($R7=\"\",\"\",TEXT(INDEX(社員データ!$A$2:$I$11,MATCH($R7,社員データ!$A$2:$A$11,0),9),\"0000000\"))","v":"0444444"},{"$f":"IF($R7=\"\",\"\",INDEX(社員データ!$A$2:$I$11,MATCH($R7,社員データ!$A$2:$A$11,0),3))","v":"ﾆﾂﾎﾟﾝﾀﾛｳ                      "},{"$f":"IF(支払データ!$D8=\"\",\"\",TEXT(支払データ!$D8,\"0000000000\"))","v":"0000004444"},0,{"$f":"IF(支払データ!$B8=\"\",\"\",TEXT(支払データ!$B8,\"0000000000\"))","v":"0044444444"},{"$f":"IF(支払データ!$C$2=\"\",\"\",TEXT(支払データ!$C$2,\"0000000000\"))","v":"0000001111"},7,"X","       ",null,{"$f":"IF(支払データ!$B8=\"\",\"\",支払データ!$B8)","v":44444444}]
[2,"0005","ﾐﾂﾋﾞｼﾄｳｷﾖｳUFJ  ",{"$f":"IF($R8=\"\",\"\",INDEX(社員データ!$A$2:$I$11,MATCH($R8,社員データ!$A$2:$A$11,0),6))","v":"213"},{"$f":"IF($R8=\"\",\"\",INDEX(社員データ!$A$2:$I$11,MATCH($R8,社員データ!$A$2:$A$11,0),7))","v":"ｶｽｶﾞｲ          "},"    ",{"$f":"IF($R8=\"\",\"\",INDEX(社員データ!$A$2:$I$11,MATCH($R8,社員データ!$A$2:$A$11,0),8))","v":1},{"$f":"IF($R8=\"\",\"\",TEXT(INDEX(社員データ!$A$2:$I$11,MATCH($R8,社員データ!$A$2:$A$11,0),9),\"0000000\"))","v":"0555555"},{"$f":"IF($R8=\"\",\"\",INDEX(社員データ!$A$2:$I$11,MATCH($R8,社員データ!$A$2:$A$11,0),3))","v":"ｵｵｻｶﾀﾛｳ                       "},{"$f":"IF(支払データ!$D9=\"\",\"\",TEXT(支払データ!$D9,\"0000000000\"))","v":"0000005555"},0,{"$f":"IF(支払データ!$B9=\"\",\"\",TEXT(支払データ!$B9,\"0000000000\"))","v":"0055555555"},{"$f":"IF(支払データ!$C$2=\"\",\"\",TEXT(支払データ!$C$2,\"0000000000\"))","v":"0000001111"},7,"X","       ",null,{"$f":"IF(支払データ!$B9=\"\",\"\",支払データ!$B9)","v":55555555}]
[2,"0005","ﾐﾂﾋﾞｼﾄｳｷﾖｳUFJ  ",{"$f":"IF($R9=\"\",\"\",INDEX(社員データ!$A$2:$I$11,MATCH($R9,社員データ!$A$2:$A$11,0),6))","v":"498"},{"$f":"IF($R9=\"\",\"\",INDEX(社員データ!$A$2:$I$11,MATCH($R9,社員データ!$A$2:$A$11,0),7))","v":"ｳﾍﾞ            "},"    ",{"$f":"IF($R9=\"\",\"\",INDEX(社員データ!$A$2:$I$11,MATCH($R9,社員データ!$A$2:$A$11,0),8))","v":1},{"$f":"IF($R9=\"\",\"\",TEXT(INDEX(社員データ!$A$2:$I$11,MATCH($R9,社員データ!$A$2:$A$11,0),9),\"0000000\"))","v":"0666666"},{"$f":"IF($R9=\"\",\"\",INDEX(社員データ!$A$2:$I$11,MATCH($R9,社員データ!$A$2:$A$11,0),3))","v":"ﾅｺﾞﾔﾀﾛｳ                       "},{"$f":"IF(支払データ!$D10=\"\",\"\",TEXT(支払データ!$D10,\"0000000000\"))","v":"0000006666"},0,{"$f":"IF(支払データ!$B10=\"\",\"\",TEXT(支払データ!$B10,\"0000000000\"))","v":"0066666666"},{"$f":"IF(支払データ!$C$2=\"\",\"\",TEXT(支払データ!$C$2,\"0000000000\"))","v":"0000001111"},7,"X","       ",null,{"$f":"IF(支払データ!$B10=\"\",\"\",支払データ!$B10)","v":66666666}]
[2,"0005","ﾐﾂﾋﾞｼﾄｳｷﾖｳUFJ  ",{"$f":"IF($R10=\"\",\"\",INDEX(社員データ!$A$2:$I$11,MATCH($R10,社員データ!$A$2:$A$11,0),6))","v":"895"},{"$f":"IF($R10=\"\",\"\",INDEX(社員データ!$A$2:$I$11,MATCH($R10,社員データ!$A$2:$A$11,0),7))","v":"ｲﾀﾊﾞｼ          "},"    ",{"$f":"IF($R10=\"\",\"\",INDEX(社員データ!$A$2:$I$11,MATCH($R10,社員データ!$A$2:$A$11,0),8))","v":1},{"$f":"IF($R10=\"\",\"\",TEXT(INDEX(社員データ!$A$2:$I$11,MATCH($R10,社員データ!$A$2:$A$11,0),9),\"0000000\"))","v":"0777777"},{"$f":"IF($R10=\"\",\"\",INDEX(社員データ!$A$2:$I$11,MATCH($R10,社員データ!$A$2:$A$11,0),3))","v":"ｻﾂﾎﾟﾛﾀﾛｳ                      "},{"$f":"IF(支払データ!$D11=\"\",\"\",TEXT(支払データ!$D11,\"0000000000\"))","v":"0000007777"},0,{"$f":"IF(支払データ!$B11=\"\",\"\",TEXT(支払データ!$B11,\"0000000000\"))","v":"0077777777"},{"$f":"IF(支払データ!$C$2=\"\",\"\",TEXT(支払データ!$C$2,\"0000000000\"))","v":"0000001111"},7,"X","       ",null,{"$f":"IF(支払データ!$B11=\"\",\"\",支払データ!$B11)","v":77777777}]
[2,"0005","ﾐﾂﾋﾞｼﾄｳｷﾖｳUFJ  ",{"$f":"IF($R11=\"\",\"\",INDEX(社員データ!$A$2:$I$11,MATCH($R11,社員データ!$A$2:$A$11,0),6))","v":"777"},{"$f":"IF($R11=\"\",\"\",INDEX(社員データ!$A$2:$I$11,MATCH($R11,社員データ!$A$2:$A$11,0),7))","v":"ｸｽﾉｷ           "},"    ",{"$f":"IF($R11=\"\",\"\",INDEX(社員データ!$A$2:$I$11,MATCH($R11,社員データ!$A$2:$A$11,0),8))","v":1},{"$f":"IF($R11=\"\",\"\",TEXT(INDEX(社員データ!$A$2:$I$11,MATCH($R11,社員データ!$A$2:$A$11,0),9),\"0000000\"))","v":"0888888"},{"$f":"IF($R11=\"\",\"\",INDEX(社員データ!$A$2:$I$11,MATCH($R11,社員データ!$A$2:$A$11,0),3))","v":"ﾌｸｵｶﾀﾛｳ                       "},{"$f":"IF(支払データ!$D12=\"\",\"\",TEXT(支払データ!$D12,\"0000000000\"))","v":"0000008888"},0,{"$f":"IF(支払データ!$B12=\"\",\"\",TEXT(支払データ!$B12,\"0000000000\"))","v":"0088888888"},{"$f":"IF(支払データ!$C$2=\"\",\"\",TEXT(支払データ!$C$2,\"0000000000\"))","v":"0000001111"},7,"X","       ",null,{"$f":"IF(支払データ!$B12=\"\",\"\",支払データ!$B12)","v":88888888}]
[2,"0005","ﾐﾂﾋﾞｼﾄｳｷﾖｳUFJ  ",{"$f":"IF($R12=\"\",\"\",INDEX(社員データ!$A$2:$I$11,MATCH($R12,社員データ!$A$2:$A$11,0),6))","v":"626"},{"$f":"IF($R12=\"\",\"\",INDEX(社員データ!$A$2:$I$11,MATCH($R12,社員データ!$A$2:$A$11,0),7))","v":"ｱｷﾊﾊﾞﾗ         "},"    ",{"$f":"IF($R12=\"\",\"\",INDEX(社員データ!$A$2:$I$11,MATCH($R12,社員データ!$A$2:$A$11,0),8))","v":1},{"$f":"IF($R12=\"\",\"\",TEXT(INDEX(社員データ!$A$2:$I$11,MATCH($R12,社員データ!$A$2:$A$11,0),9),\"0000000\"))","v":"0999999"},{"$f":"IF($R12=\"\",\"\",INDEX(社員データ!$A$2:$I$11,MATCH($R12,社員データ!$A$2:$A$11,0),3))","v":"ｷﾖｳﾄﾀﾛｳ                       "},{"$f":"IF(支払データ!$D13=\"\",\"\",TEXT(支払データ!$D13,\"0000000000\"))","v":"0000009999"},0,{"$f":"IF(支払データ!$B13=\"\",\"\",TEXT(支払データ!$B13,\"0000000000\"))","v":"0099999999"},{"$f":"IF(支払データ!$C$2=\"\",\"\",TEXT(支払データ!$C$2,\"0000000000\"))","v":"0000001111"},7,"X","       ",null,{"$f":"IF(支払データ!$B13=\"\",\"\",支払データ!$B13)","v":99999999}]
[2,"0005","ﾐﾂﾋﾞｼﾄｳｷﾖｳUFJ  ",{"$f":"IF($R13=\"\",\"\",INDEX(社員データ!$A$2:$I$11,MATCH($R13,社員データ!$A$2:$A$11,0),6))","v":"713"},{"$f":"IF($R13=\"\",\"\",INDEX(社員データ!$A$2:$I$11,MATCH($R13,社員データ!$A$2:$A$11,0),7))","v":"ｼﾂﾞ            "},"    ",{"$f":"IF($R13=\"\",\"\",INDEX(社員データ!$A$2:$I$11,MATCH($R13,社員データ!$A$2:$A$11,0),8))","v":1},{"$f":"IF($R13=\"\",\"\",TEXT(INDEX(社員データ!$A$2:$I$11,MATCH($R13,社員データ!$A$2:$A$11,0),9),\"0000000\"))","v":"1234567"},{"$f":"IF($R13=\"\",\"\",INDEX(社員データ!$A$2:$I$11,MATCH($R13,社員データ!$A$2:$A$11,0),3))","v":"ﾖｺﾊﾏﾀﾛｳ                       "},{"$f":"IF(支払データ!$D14=\"\",\"\",TEXT(支払データ!$D14,\"0000000000\"))","v":"0000001000"},0,{"$f":"IF(支払データ!$B14=\"\",\"\",TEXT(支払データ!$B14,\"0000000000\"))","v":"0012345678"},{"$f":"IF(支払データ!$C$2=\"\",\"\",TEXT(支払データ!$C$2,\"0000000000\"))","v":"0000001111"},7,"X","       ",null,{"$f":"IF(支払データ!$B14=\"\",\"\",支払データ!$B14)","v":12345678}]
[2,"0005","ﾐﾂﾋﾞｼﾄｳｷﾖｳUFJ  ",{"$f":"IF($R14=\"\",\"\",INDEX(社員データ!$A$2:$I$11,MATCH($R14,社員データ!$A$2:$A$11,0),6))","v":"001"},{"$f":"IF($R14=\"\",\"\",INDEX(社員データ!$A$2:$I$11,MATCH($R14,社員データ!$A$2:$A$11,0),7))","v":"ﾎﾝﾃﾝ           "},"    ",{"$f":"IF($R14=\"\",\"\",INDEX(社員データ!$A$2:$I$11,MATCH($R14,社員データ!$A$2:$A$11,0),8))","v":1},{"$f":"IF($R14=\"\",\"\",TEXT(INDEX(社員データ!$A$2:$I$11,MATCH($R14,社員データ!$A$2:$A$11,0),9),\"0000000\"))","v":"0111111"},{"$f":"IF($R14=\"\",\"\",INDEX(社員データ!$A$2:$I$11,MATCH($R14,社員データ!$A$2:$A$11,0),3))","v":"ﾐﾂﾋﾞｼﾀﾛｳ                      "},{"$f":"IF(支払データ!$D15=\"\",\"\",TEXT(支払データ!$D15,\"0000000000\"))","v":"0000001111"},0,{"$f":"IF(支払データ!$B15=\"\",\"\",TEXT(支払データ!$B15,\"0000000000\"))","v":"0011111111"},{"$f":"IF(支払データ!$C$2=\"\",\"\",TEXT(支払データ!$C$2,\"0000000000\"))","v":"0000001111"},7,"X","       ",null,{"$f":"IF(支払データ!$B15=\"\",\"\",支払データ!$B15)","v":11111111}]
[2,"0005","ﾐﾂﾋﾞｼﾄｳｷﾖｳUFJ  ",{"$f":"IF($R15=\"\",\"\",INDEX(社員データ!$A$2:$I$11,MATCH($R15,社員データ!$A$2:$A$11,0),6))","v":"005"},{"$f":"IF($R15=\"\",\"\",INDEX(社員データ!$A$2:$I$11,MATCH($R15,社員データ!$A$2:$A$11,0),7))","v":"ｵｵｻｶ           "},"    ",{"$f":"IF($R15=\"\",\"\",INDEX(社員データ!$A$2:$I$11,MATCH($R15,社員データ!$A$2:$A$11,0),8))","v":1},{"$f":"IF($R15=\"\",\"\",TEXT(INDEX(社員データ!$A$2:$I$11,MATCH($R15,社員データ!$A$2:$A$11,0),9),\"0000000\"))","v":"0222222"},{"$f":"IF($R15=\"\",\"\",INDEX(社員データ!$A$2:$I$11,MATCH($R15,社員データ!$A$2:$A$11,0),3))","v":"UFJﾀﾛｳ                        "},{"$f":"IF(支払データ!$D16=\"\",\"\",TEXT(支払データ!$D16,\"0000000000\"))","v":"0000002222"},0,{"$f":"IF(支払データ!$B16=\"\",\"\",TEXT(支払データ!$B16,\"0000000000\"))","v":"0022222222"},{"$f":"IF(支払データ!$C$2=\"\",\"\",TEXT(支払データ!$C$2,\"0000000000\"))","v":"0000001111"},7,"X","       ",null,{"$f":"IF(支払データ!$B16=\"\",\"\",支払データ!$B16)","v":22222222}]
[2,"0005","ﾐﾂﾋﾞｼﾄｳｷﾖｳUFJ  ",{"$f":"IF($R16=\"\",\"\",INDEX(社員データ!$A$2:$I$11,MATCH($R16,社員データ!$A$2:$A$11,0),6))","v":"150"},{"$f":"IF($R16=\"\",\"\",INDEX(社員データ!$A$2:$I$11,MATCH($R16,社員データ!$A$2:$A$11,0),7))","v":"ﾅｺﾞﾔ           "},"    ",{"$f":"IF($R16=\"\",\"\",INDEX(社員データ!$A$2:$I$11,MATCH($R16,社員データ!$A$2:$A$11,0),8))","v":1},{"$f":"IF($R16=\"\",\"\",TEXT(INDEX(社員データ!$A$2:$I$11,MATCH($R16,社員データ!$A$2:$A$11,0),9),\"0000000\"))","v":"0333333"},{"$f":"IF($R16=\"\",\"\",INDEX(社員データ!$A$2:$I$11,MATCH($R16,社員データ!$A$2:$A$11,0),3))","v":"ﾄｳｷﾖｳﾀﾛｳ                      "},{"$f":"IF(支払データ!$D17=\"\",\"\",TEXT(支払データ!$D17,\"0000000000\"))","v":"0000003333"},0,{"$f":"IF(支払データ!$B17=\"\",\"\",TEXT(支払データ!$B17,\"0000000000\"))","v":"0033333333"},{"$f":"IF(支払データ!$C$2=\"\",\"\",TEXT(支払データ!$C$2,\"0000000000\"))","v":"0000001111"},7,"X","       ",null,{"$f":"IF(支払データ!$B17=\"\",\"\",支払データ!$B17)","v":33333333}]
[2,"0005","ﾐﾂﾋﾞｼﾄｳｷﾖｳUFJ  ",{"$f":"IF($R17=\"\",\"\",INDEX(社員データ!$A$2:$I$11,MATCH($R17,社員データ!$A$2:$A$11,0),6))","v":"333"},{"$f":"IF($R17=\"\",\"\",INDEX(社員データ!$A$2:$I$11,MATCH($R17,社員データ!$A$2:$A$11,0),7))","v":"ﾆﾎﾝﾊﾞｼﾁﾕｳｵｳ    "},"    ",{"$f":"IF($R17=\"\",\"\",INDEX(社員データ!$A$2:$I$11,MATCH($R17,社員データ!$A$2:$A$11,0),8))","v":1},{"$f":"IF($R17=\"\",\"\",TEXT(INDEX(社員データ!$A$2:$I$11,MATCH($R17,社員データ!$A$2:$A$11,0),9),\"0000000\"))","v":"0444444"},{"$f":"IF($R17=\"\",\"\",INDEX(社員データ!$A$2:$I$11,MATCH($R17,社員データ!$A$2:$A$11,0),3))","v":"ﾆﾂﾎﾟﾝﾀﾛｳ                      "},{"$f":"IF(支払データ!$D18=\"\",\"\",TEXT(支払データ!$D18,\"0000000000\"))","v":"0000004444"},0,{"$f":"IF(支払データ!$B18=\"\",\"\",TEXT(支払データ!$B18,\"0000000000\"))","v":"0044444444"},{"$f":"IF(支払データ!$C$2=\"\",\"\",TEXT(支払データ!$C$2,\"0000000000\"))","v":"0000001111"},7,"X","       ",null,{"$f":"IF(支払データ!$B18=\"\",\"\",支払データ!$B18)","v":44444444}]
[2,"0005","ﾐﾂﾋﾞｼﾄｳｷﾖｳUFJ  ",{"$f":"IF($R18=\"\",\"\",INDEX(社員データ!$A$2:$I$11,MATCH($R18,社員データ!$A$2:$A$11,0),6))","v":"213"},{"$f":"IF($R18=\"\",\"\",INDEX(社員データ!$A$2:$I$11,MATCH($R18,社員データ!$A$2:$A$11,0),7))","v":"ｶｽｶﾞｲ          "},"    ",{"$f":"IF($R18=\"\",\"\",INDEX(社員データ!$A$2:$I$11,MATCH($R18,社員データ!$A$2:$A$11,0),8))","v":1},{"$f":"IF($R18=\"\",\"\",TEXT(INDEX(社員データ!$A$2:$I$11,MATCH($R18,社員データ!$A$2:$A$11,0),9),\"0000000\"))","v":"0555555"},{"$f":"IF($R18=\"\",\"\",INDEX(社員データ!$A$2:$I$11,MATCH($R18,社員データ!$A$2:$A$11,0),3))","v":"ｵｵｻｶﾀﾛｳ                       "},{"$f":"IF(支払データ!$D19=\"\",\"\",TEXT(支払データ!$D19,\"0000000000\"))","v":"0000005555"},0,{"$f":"IF(支払データ!$B19=\"\",\"\",TEXT(支払データ!$B19,\"0000000000\"))","v":"0055555555"},{"$f":"IF(支払データ!$C$2=\"\",\"\",TEXT(支払データ!$C$2,\"0000000000\"))","v":"0000001111"},7,"X","       ",null,{"$f":"IF(支払データ!$B19=\"\",\"\",支払データ!$B19)","v":55555555}]
[2,"0005","ﾐﾂﾋﾞｼﾄｳｷﾖｳUFJ  ",{"$f":"IF($R19=\"\",\"\",INDEX(社員データ!$A$2:$I$11,MATCH($R19,社員データ!$A$2:$A$11,0),6))","v":"498"},{"$f":"IF($R19=\"\",\"\",INDEX(社員データ!$A$2:$I$11,MATCH($R19,社員データ!$A$2:$A$11,0),7))","v":"ｳﾍﾞ            "},"    ",{"$f":"IF($R19=\"\",\"\",INDEX(社員データ!$A$2:$I$11,MATCH($R19,社員データ!$A$2:$A$11,0),8))","v":1},{"$f":"IF($R19=\"\",\"\",TEXT(INDEX(社員データ!$A$2:$I$11,MATCH($R19,社員データ!$A$2:$A$11,0),9),\"0000000\"))","v":"0666666"},{"$f":"IF($R19=\"\",\"\",INDEX(社員データ!$A$2:$I$11,MATCH($R19,社員データ!$A$2:$A$11,0),3))","v":"ﾅｺﾞﾔﾀﾛｳ                       "},{"$f":"IF(支払データ!$D20=\"\",\"\",TEXT(支払データ!$D20,\"0000000000\"))","v":"0000006666"},0,{"$f":"IF(支払データ!$B20=\"\",\"\",TEXT(支払データ!$B20,\"0000000000\"))","v":"0066666666"},{"$f":"IF(支払データ!$C$2=\"\",\"\",TEXT(支払データ!$C$2,\"0000000000\"))","v":"0000001111"},7,"X","       ",null,{"$f":"IF(支払データ!$B20=\"\",\"\",支払データ!$B20)","v":66666666}]
[2,"0005","ﾐﾂﾋﾞｼﾄｳｷﾖｳUFJ  ",{"$f":"IF($R20=\"\",\"\",INDEX(社員データ!$A$2:$I$11,MATCH($R20,社員データ!$A$2:$A$11,0),6))","v":"895"},{"$f":"IF($R20=\"\",\"\",INDEX(社員データ!$A$2:$I$11,MATCH($R20,社員データ!$A$2:$A$11,0),7))","v":"ｲﾀﾊﾞｼ          "},"    ",{"$f":"IF($R20=\"\",\"\",INDEX(社員データ!$A$2:$I$11,MATCH($R20,社員データ!$A$2:$A$11,0),8))","v":1},{"$f":"IF($R20=\"\",\"\",TEXT(INDEX(社員データ!$A$2:$I$11,MATCH($R20,社員データ!$A$2:$A$11,0),9),\"0000000\"))","v":"0777777"},{"$f":"IF($R20=\"\",\"\",INDEX(社員データ!$A$2:$I$11,MATCH($R20,社員データ!$A$2:$A$11,0),3))","v":"ｻﾂﾎﾟﾛﾀﾛｳ                      "},{"$f":"IF(支払データ!$D21=\"\",\"\",TEXT(支払データ!$D21,\"0000000000\"))","v":"0000007777"},0,{"$f":"IF(支払データ!$B21=\"\",\"\",TEXT(支払データ!$B21,\"0000000000\"))","v":"0077777777"},{"$f":"IF(支払データ!$C$2=\"\",\"\",TEXT(支払データ!$C$2,\"0000000000\"))","v":"0000001111"},7,"X","       ",null,{"$f":"IF(支払データ!$B21=\"\",\"\",支払データ!$B21)","v":77777777}]
{"$rows_left_out":4}
{"sheet":"全銀形式（ソート)","index":6,"n_rows":0,"n_cols":0,"rows_kept":0,"cut":false,"hidden":false,"merged":[]}